{"text_format":"1","workbook":"xlsx","n_sheets":6,"sheets":["Registration-Qualifying","Round Robin-StepLadder","Standings","ScoreSheets","ScoreSheet-MP","RR Seeds"],"not_rendered":{"charts":0,"images":1,"macros":1,"external_links":1,"defined_names":40,"comments":0,"pivot_tables":0},"unopened":[],"bounds":{"document_bytes":16777216,"sheet_cells":100000,"rows_first":2000,"rows_last":500,"rows_between":2000,"halvings":0,"cell_chars":16384,"cell_head_chars":4096},"cells_cut":0,"cells_raw":0,"read":"whole","date_system":"1900"}

{"sheet":"Registration-Qualifying","index":0,"n_rows":35,"n_cols":36,"rows_kept":35,"cut":false,"hidden":false,"merged":[[0,4,0,8]]}
[null,null,null,null,"1st Round",null,null,null,null,null,null,null,null,null,null,null,null,null,null,null,null,null,null,null,null,null,null,null,null,null,null,null,null,"# of Bowlers","Starting","Ending"]
["Lane","Pos","Starting","Name","Game1","Game2","Game3","Game4","Total","RANK1","RR1","RR2","RR3","RR4","RR5","RR6","RR7","RR Total","B1","B2","B3","B4","B5","B6","B7","Btotal","SUBTotal","RankST","RR8","B8","GT","RankGT",null,{"$f":"COUNTA(D:D)-1","v":33},{"$f":"MIN(tScores[Lane])","v":3},{"$f":"MAX(tScores[Lane])","v":18}]
[3,"A",{"$f":"IF(tScores[[#This Row],[Name]]=\"\",\"\",tScores[[#This Row],[Lane]]&\"-\"&tScores[[#This Row],[Pos]])","v":"3-A"},"Steve Marcus",249,237,213,233,{"$f":"IFERROR(IF(tScores[[#This Row],[Name]]=\"\",\"\",SUM(tScores[[#This Row],[Game1]:[Game4]]))+MAX(tScores[[#This Row],[Game1]:[Game4]])/10000,\"\")","v":932.0249},{"$f":"IF(tScores[[#This Row],[Name]]=\"\",\"\",RANK(tScores[[#This Row],[Total]],tScores[Total])+(COUNTIF($I$3:$I3,tScores[[#This Row],[Total]]))-1)","v":6},{"$f":"IFERROR(VLOOKUP(tScores[[#This Row],[Name]],RRGM1,2,0),\"\")","v":235},{"$f":"IFERROR(VLOOKUP(tScores[[#This Row],[Name]],RRGM2,2,0),\"\")","v":145},{"$f":"IFERROR(VLOOKUP(tScores[[#This Row],[Name]],RRGM3,2,0),\"\")","v":195},{"$f":"IFERROR(VLOOKUP(tScores[[#This Row],[Name]],RRGM4,2,0),\"\")","v":192},{"$f":"IFERROR(VLOOKUP(tScores[[#This Row],[Name]],RRGM5,2,0),\"\")","v":190},{"$f":"IFERROR(VLOOKUP(tScores[[#This Row],[Name]],RRGM6,2,0),\"\")","v":214},{"$f":"IFERROR(VLOOKUP(tScores[[#This Row],[Name]],RRGM7,2,0),\"\")","v":195},{"$f":"SUM(tScores[[#This Row],[RR1]:[RR7]])+MAX(tScores[[#This Row],[RANK1]:[RR7]])/10000","v":1366.0235},{"$f":"IFERROR(VLOOKUP(tScores[[#This Row],[Name]],RRGM1,3,0),\"\")","v":30},{"$f":"IFERROR(VLOOKUP(tScores[[#This Row],[Name]],RRGM2,3,0),\"\")","v":0},{"$f":"IFERROR(VLOOKUP(tScores[[#This Row],[Name]],RRGM3,3,0),\"\")","v":30},{"$f":"IFERROR(VLOOKUP(tScores[[#This Row],[Name]],RRGM4,3,0),\"\")","v":30},{"$f":"IFERROR(VLOOKUP(tScores[[#This Row],[Name]],RRGM5,3,0),\"\")","v":0},{"$f":"IFERROR(VLOOKUP(tScores[[#This Row],[Name]],RRGM6,3,0),\"\")","v":0},{"$f":"IFERROR(VLOOKUP(tScores[[#This Row],[Name]],RRGM7,3,0),\"\")","v":30},{"$f":"SUM(tScores[[#This Row],[B1]:[B7]])","v":120},{"$f":"IFERROR(tScores[[#This Row],[Total]]+tScores[[#This Row],[RR Total]]+tScores[[#This Row],[Btotal]],\"\")","v":2418.0484000000001},{"$f":"IF(tScores[[#This Row],[Name]]=\"\",\"\",RANK(tScores[[#This Row],[SUBTotal]],tScores[SUBTotal])+(COUNTIF($AA$3:$AA3,tScores[[#This Row],[SUBTotal]]))-1)","v":7},{"$f":"IFERROR(VLOOKUP(tScores[[#This Row],[Name]],RRGM8,2,0),\"\")","v":197},{"$f":"IFERROR(VLOOKUP(tScores[[#This Row],[Name]],RRGM8,3,0),\"\")","v":30},{"$f":"IFERROR(tScores[[#This Row],[SUBTotal]]+SUM(tScores[[#This Row],[RR8]:[B8]]),\"\")","v":2645.0484000000001},{"$f":"IF(tScores[[#This Row],[Name]]=\"\",\"\",RANK(tScores[[#This Row],[GT]],tScores[GT])+(COUNTIF($AE$3:$AE3,tScores[[#This Row],[GT]]))-1)","v":7}]
[3,"b",{"$f":"IF(tScores[[#This Row],[Name]]=\"\",\"\",tScores[[#This Row],[Lane]]&\"-\"&tScores[[#This Row],[Pos]])","v":"3-b"},"Don Veltman",259,196,214,217,{"$f":"IFERROR(IF(tScores[[#This Row],[Name]]=\"\",\"\",SUM(tScores[[#This Row],[Game1]:[Game4]]))+MAX(tScores[[#This Row],[Game1]:[Game4]])/10000,\"\")","v":886.02589999999998},{"$f":"IF(tScores[[#This Row],[Name]]=\"\",\"\",RANK(tScores[[#This Row],[Total]],tScores[Total])+(COUNTIF($I$3:$I4,tScores[[#This Row],[Total]]))-1)","v":11},{"$f":"IFERROR(VLOOKUP(tScores[[#This Row],[Name]],RRGM1,2,0),\"\")","v":""},{"$f":"IFERROR(VLOOKUP(tScores[[#This Row],[Name]],RRGM2,2,0),\"\")","v":""},{"$f":"IFERROR(VLOOKUP(tScores[[#This Row],[Name]],RRGM3,2,0),\"\")","v":""},{"$f":"IFERROR(VLOOKUP(tScores[[#This Row],[Name]],RRGM4,2,0),\"\")","v":""},{"$f":"IFERROR(VLOOKUP(tScores[[#This Row],[Name]],RRGM5,2,0),\"\")","v":""},{"$f":"IFERROR(VLOOKUP(tScores[[#This Row],[Name]],RRGM6,2,0),\"\")","v":""},{"$f":"IFERROR(VLOOKUP(tScores[[#This Row],[Name]],RRGM7,2,0),\"\")","v":""},{"$f":"SUM(tScores[[#This Row],[RR1]:[RR7]])+MAX(tScores[[#This Row],[RANK1]:[RR7]])/10000","v":1.1000000000000001E-3},{"$f":"IFERROR(VLOOKUP(tScores[[#This Row],[Name]],RRGM1,3,0),\"\")","v":""},{"$f":"IFERROR(VLOOKUP(tScores[[#This Row],[Name]],RRGM2,3,0),\"\")","v":""},{"$f":"IFERROR(VLOOKUP(tScores[[#This Row],[Name]],RRGM3,3,0),\"\")","v":""},{"$f":"IFERROR(VLOOKUP(tScores[[#This Row],[Name]],RRGM4,3,0),\"\")","v":""},{"$f":"IFERROR(VLOOKUP(tScores[[#This Row],[Name]],RRGM5,3,0),\"\")","v":""},{"$f":"IFERROR(VLOOKUP(tScores[[#This Row],[Name]],RRGM6,3,0),\"\")","v":""},{"$f":"IFERROR(VLOOKUP(tScores[[#This Row],[Name]],RRGM7,3,0),\"\")","v":""},{"$f":"SUM(tScores[[#This Row],[B1]:[B7]])","v":0},{"$f":"IFERROR(tScores[[#This Row],[Total]]+tScores[[#This Row],[RR Total]]+tScores[[#This Row],[Btotal]],\"\")","v":886.02699999999993},{"$f":"IF(tScores[[#This Row],[Name]]=\"\",\"\",RANK(tScores[[#This Row],[SUBTotal]],tScores[SUBTotal])+(COUNTIF($AA$3:$AA4,tScores[[#This Row],[SUBTotal]]))-1)","v":11},{"$f":"IFERROR(VLOOKUP(tScores[[#This Row],[Name]],RRGM8,2,0),\"\")","v":""},{"$f":"IFERROR(VLOOKUP(tScores[[#This Row],[Name]],RRGM8,3,0),\"\")","v":""},{"$f":"IFERROR(tScores[[#This Row],[SUBTotal]]+SUM(tScores[[#This Row],[RR8]:[B8]]),\"\")","v":886.02699999999993},{"$f":"IF(tScores[[#This Row],[Name]]=\"\",\"\",RANK(tScores[[#This Row],[GT]],tScores[GT])+(COUNTIF($AE$3:$AE4,tScores[[#This Row],[GT]]))-1)","v":11}]
[3,"c",{"$f":"IF(tScores[[#This Row],[Name]]=\"\",\"\",tScores[[#This Row],[Lane]]&\"-\"&tScores[[#This Row],[Pos]])","v":"3-c"},"Eric Bottrall",211,150,204,210,{"$f":"IFERROR(IF(tScores[[#This Row],[Name]]=\"\",\"\",SUM(tScores[[#This Row],[Game1]:[Game4]]))+MAX(tScores[[#This Row],[Game1]:[Game4]])/10000,\"\")","v":775.02110000000005},{"$f":"IF(tScores[[#This Row],[Name]]=\"\",\"\",RANK(tScores[[#This Row],[Total]],tScores[Total])+(COUNTIF($I$3:$I5,tScores[[#This Row],[Total]]))-1)","v":28},{"$f":"IFERROR(VLOOKUP(tScores[[#This Row],[Name]],RRGM1,2,0),\"\")","v":""},{"$f":"IFERROR(VLOOKUP(tScores[[#This Row],[Name]],RRGM2,2,0),\"\")","v":""},{"$f":"IFERROR(VLOOKUP(tScores[[#This Row],[Name]],RRGM3,2,0),\"\")","v":""},{"$f":"IFERROR(VLOOKUP(tScores[[#This Row],[Name]],RRGM4,2,0),\"\")","v":""},{"$f":"IFERROR(VLOOKUP(tScores[[#This Row],[Name]],RRGM5,2,0),\"\")","v":""},{"$f":"IFERROR(VLOOKUP(tScores[[#This Row],[Name]],RRGM6,2,0),\"\")","v":""},{"$f":"IFERROR(VLOOKUP(tScores[[#This Row],[Name]],RRGM7,2,0),\"\")","v":""},{"$f":"SUM(tScores[[#This Row],[RR1]:[RR7]])+MAX(tScores[[#This Row],[RANK1]:[RR7]])/10000","v":2.8E-3},{"$f":"IFERROR(VLOOKUP(tScores[[#This Row],[Name]],RRGM1,3,0),\"\")","v":""},{"$f":"IFERROR(VLOOKUP(tScores[[#This Row],[Name]],RRGM2,3,0),\"\")","v":""},{"$f":"IFERROR(VLOOKUP(tScores[[#This Row],[Name]],RRGM3,3,0),\"\")","v":""},{"$f":"IFERROR(VLOOKUP(tScores[[#This Row],[Name]],RRGM4,3,0),\"\")","v":""},{"$f":"IFERROR(VLOOKUP(tScores[[#This Row],[Name]],RRGM5,3,0),\"\")","v":""},{"$f":"IFERROR(VLOOKUP(tScores[[#This Row],[Name]],RRGM6,3,0),\"\")","v":""},{"$f":"IFERROR(VLOOKUP(tScores[[#This Row],[Name]],RRGM7,3,0),\"\")","v":""},{"$f":"SUM(tScores[[#This Row],[B1]:[B7]])","v":0},{"$f":"IFERROR(tScores[[#This Row],[Total]]+tScores[[#This Row],[RR Total]]+tScores[[#This Row],[Btotal]],\"\")","v":775.02390000000003},{"$f":"IF(tScores[[#This Row],[Name]]=\"\",\"\",RANK(tScores[[#This Row],[SUBTotal]],tScores[SUBTotal])+(COUNTIF($AA$3:$AA5,tScores[[#This Row],[SUBTotal]]))-1)","v":28},{"$f":"IFERROR(VLOOKUP(tScores[[#This Row],[Name]],RRGM8,2,0),\"\")","v":""},{"$f":"IFERROR(VLOOKUP(tScores[[#This Row],[Name]],RRGM8,3,0),\"\")","v":""},{"$f":"IFERROR(tScores[[#This Row],[SUBTotal]]+SUM(tScores[[#This Row],[RR8]:[B8]]),\"\")","v":775.02390000000003},{"$f":"IF(tScores[[#This Row],[Name]]=\"\",\"\",RANK(tScores[[#This Row],[GT]],tScores[GT])+(COUNTIF($AE$3:$AE5,tScores[[#This Row],[GT]]))-1)","v":28}]
[4,"d",{"$f":"IF(tScores[[#This Row],[Name]]=\"\",\"\",tScores[[#This Row],[Lane]]&\"-\"&tScores[[#This Row],[Pos]])","v":"4-d"},"David Napier",203,180,211,175,{"$f":"IFERROR(IF(tScores[[#This Row],[Name]]=\"\",\"\",SUM(tScores[[#This Row],[Game1]:[Game4]]))+MAX(tScores[[#This Row],[Game1]:[Game4]])/10000,\"\")","v":769.02110000000005},{"$f":"IF(tScores[[#This Row],[Name]]=\"\",\"\",RANK(tScores[[#This Row],[Total]],tScores[Total])+(COUNTIF($I$3:$I6,tScores[[#This Row],[Total]]))-1)","v":29},{"$f":"IFERROR(VLOOKUP(tScores[[#This Row],[Name]],RRGM1,2,0),\"\")","v":""},{"$f":"IFERROR(VLOOKUP(tScores[[#This Row],[Name]],RRGM2,2,0),\"\")","v":""},{"$f":"IFERROR(VLOOKUP(tScores[[#This Row],[Name]],RRGM3,2,0),\"\")","v":""},{"$f":"IFERROR(VLOOKUP(tScores[[#This Row],[Name]],RRGM4,2,0),\"\")","v":""},{"$f":"IFERROR(VLOOKUP(tScores[[#This Row],[Name]],RRGM5,2,0),\"\")","v":""},{"$f":"IFERROR(VLOOKUP(tScores[[#This Row],[Name]],RRGM6,2,0),\"\")","v":""},{"$f":"IFERROR(VLOOKUP(tScores[[#This Row],[Name]],RRGM7,2,0),\"\")","v":""},{"$f":"SUM(tScores[[#This Row],[RR1]:[RR7]])+MAX(tScores[[#This Row],[RANK1]:[RR7]])/10000","v":2.8999999999999998E-3},{"$f":"IFERROR(VLOOKUP(tScores[[#This Row],[Name]],RRGM1,3,0),\"\")","v":""},{"$f":"IFERROR(VLOOKUP(tScores[[#This Row],[Name]],RRGM2,3,0),\"\")","v":""},{"$f":"IFERROR(VLOOKUP(tScores[[#This Row],[Name]],RRGM3,3,0),\"\")","v":""},{"$f":"IFERROR(VLOOKUP(tScores[[#This Row],[Name]],RRGM4,3,0),\"\")","v":""},{"$f":"IFERROR(VLOOKUP(tScores[[#This Row],[Name]],RRGM5,3,0),\"\")","v":""},{"$f":"IFERROR(VLOOKUP(tScores[[#This Row],[Name]],RRGM6,3,0),\"\")","v":""},{"$f":"IFERROR(VLOOKUP(tScores[[#This Row],[Name]],RRGM7,3,0),\"\")","v":""},{"$f":"SUM(tScores[[#This Row],[B1]:[B7]])","v":0},{"$f":"IFERROR(tScores[[#This Row],[Total]]+tScores[[#This Row],[RR Total]]+tScores[[#This Row],[Btotal]],\"\")","v":769.024},{"$f":"IF(tScores[[#This Row],[Name]]=\"\",\"\",RANK(tScores[[#This Row],[SUBTotal]],tScores[SUBTotal])+(COUNTIF($AA$3:$AA6,tScores[[#This Row],[SUBTotal]]))-1)","v":29},{"$f":"IFERROR(VLOOKUP(tScores[[#This Row],[Name]],RRGM8,2,0),\"\")","v":""},{"$f":"IFERROR(VLOOKUP(tScores[[#This Row],[Name]],RRGM8,3,0),\"\")","v":""},{"$f":"IFERROR(tScores[[#This Row],[SUBTotal]]+SUM(tScores[[#This Row],[RR8]:[B8]]),\"\")","v":769.024},{"$f":"IF(tScores[[#This Row],[Name]]=\"\",\"\",RANK(tScores[[#This Row],[GT]],tScores[GT])+(COUNTIF($AE$3:$AE6,tScores[[#This Row],[GT]]))-1)","v":29}]
[4,"e",{"$f":"IF(tScores[[#This Row],[Name]]=\"\",\"\",tScores[[#This Row],[Lane]]&\"-\"&tScores[[#This Row],[Pos]])","v":"4-e"},"Dale Rockewell",168,181,204,211,{"$f":"IFERROR(IF(tScores[[#This Row],[Name]]=\"\",\"\",SUM(tScores[[#This Row],[Game1]:[Game4]]))+MAX(tScores[[#This Row],[Game1]:[Game4]])/10000,\"\")","v":764.02110000000005},{"$f":"IF(tScores[[#This Row],[Name]]=\"\",\"\",RANK(tScores[[#This Row],[Total]],tScores[Total])+(COUNTIF($I$3:$I7,tScores[[#This Row],[Total]]))-1)","v":31},{"$f":"IFERROR(VLOOKUP(tScores[[#This Row],[Name]],RRGM1,2,0),\"\")","v":""},{"$f":"IFERROR(VLOOKUP(tScores[[#This Row],[Name]],RRGM2,2,0),\"\")","v":""},{"$f":"IFERROR(VLOOKUP(tScores[[#This Row],[Name]],RRGM3,2,0),\"\")","v":""},{"$f":"IFERROR(VLOOKUP(tScores[[#This Row],[Name]],RRGM4,2,0),\"\")","v":""},{"$f":"IFERROR(VLOOKUP(tScores[[#This Row],[Name]],RRGM5,2,0),\"\")","v":""},{"$f":"IFERROR(VLOOKUP(tScores[[#This Row],[Name]],RRGM6,2,0),\"\")","v":""},{"$f":"IFERROR(VLOOKUP(tScores[[#This Row],[Name]],RRGM7,2,0),\"\")","v":""},{"$f":"SUM(tScores[[#This Row],[RR1]:[RR7]])+MAX(tScores[[#This Row],[RANK1]:[RR7]])/10000","v":3.0999999999999999E-3},{"$f":"IFERROR(VLOOKUP(tScores[[#This Row],[Name]],RRGM1,3,0),\"\")","v":""},{"$f":"IFERROR(VLOOKUP(tScores[[#This Row],[Name]],RRGM2,3,0),\"\")","v":""},{"$f":"IFERROR(VLOOKUP(tScores[[#This Row],[Name]],RRGM3,3,0),\"\")","v":""},{"$f":"IFERROR(VLOOKUP(tScores[[#This Row],[Name]],RRGM4,3,0),\"\")","v":""},{"$f":"IFERROR(VLOOKUP(tScores[[#This Row],[Name]],RRGM5,3,0),\"\")","v":""},{"$f":"IFERROR(VLOOKUP(tScores[[#This Row],[Name]],RRGM6,3,0),\"\")","v":""},{"$f":"IFERROR(VLOOKUP(tScores[[#This Row],[Name]],RRGM7,3,0),\"\")","v":""},{"$f":"SUM(tScores[[#This Row],[B1]:[B7]])","v":0},{"$f":"IFERROR(tScores[[#This Row],[Total]]+tScores[[#This Row],[RR Total]]+tScores[[#This Row],[Btotal]],\"\")","v":764.02420000000006},{"$f":"IF(tScores[[#This Row],[Name]]=\"\",\"\",RANK(tScores[[#This Row],[SUBTotal]],tScores[SUBTotal])+(COUNTIF($AA$3:$AA7,tScores[[#This Row],[SUBTotal]]))-1)","v":31},{"$f":"IFERROR(VLOOKUP(tScores[[#This Row],[Name]],RRGM8,2,0),\"\")","v":""},{"$f":"IFERROR(VLOOKUP(tScores[[#This Row],[Name]],RRGM8,3,0),\"\")","v":""},{"$f":"IFERROR(tScores[[#This Row],[SUBTotal]]+SUM(tScores[[#This Row],[RR8]:[B8]]),\"\")","v":764.02420000000006},{"$f":"IF(tScores[[#This Row],[Name]]=\"\",\"\",RANK(tScores[[#This Row],[GT]],tScores[GT])+(COUNTIF($AE$3:$AE7,tScores[[#This Row],[GT]]))-1)","v":31}]
[5,"A",{"$f":"IF(tScores[[#This Row],[Name]]=\"\",\"\",tScores[[#This Row],[Lane]]&\"-\"&tScores[[#This Row],[Pos]])","v":"5-A"},"Jeremy Bartz",205,196,256,236,{"$f":"IFERROR(IF(tScores[[#This Row],[Name]]=\"\",\"\",SUM(tScores[[#This Row],[Game1]:[Game4]]))+MAX(tScores[[#This Row],[Game1]:[Game4]])/10000,\"\")","v":893.02560000000005},{"$f":"IF(tScores[[#This Row],[Name]]=\"\",\"\",RANK(tScores[[#This Row],[Total]],tScores[Total])+(COUNTIF($I$3:$I8,tScores[[#This Row],[Total]]))-1)","v":10},{"$f":"IFERROR(VLOOKUP(tScores[[#This Row],[Name]],RRGM1,2,0),\"\")","v":""},{"$f":"IFERROR(VLOOKUP(tScores[[#This Row],[Name]],RRGM2,2,0),\"\")","v":""},{"$f":"IFERROR(VLOOKUP(tScores[[#This Row],[Name]],RRGM3,2,0),\"\")","v":""},{"$f":"IFERROR(VLOOKUP(tScores[[#This Row],[Name]],RRGM4,2,0),\"\")","v":""},{"$f":"IFERROR(VLOOKUP(tScores[[#This Row],[Name]],RRGM5,2,0),\"\")","v":""},{"$f":"IFERROR(VLOOKUP(tScores[[#This Row],[Name]],RRGM6,2,0),\"\")","v":""},{"$f":"IFERROR(VLOOKUP(tScores[[#This Row],[Name]],RRGM7,2,0),\"\")","v":""},{"$f":"SUM(tScores[[#This Row],[RR1]:[RR7]])+MAX(tScores[[#This Row],[RANK1]:[RR7]])/10000","v":1E-3},{"$f":"IFERROR(VLOOKUP(tScores[[#This Row],[Name]],RRGM1,3,0),\"\")","v":""},{"$f":"IFERROR(VLOOKUP(tScores[[#This Row],[Name]],RRGM2,3,0),\"\")","v":""},{"$f":"IFERROR(VLOOKUP(tScores[[#This Row],[Name]],RRGM3,3,0),\"\")","v":""},{"$f":"IFERROR(VLOOKUP(tScores[[#This Row],[Name]],RRGM4,3,0),\"\")","v":""},{"$f":"IFERROR(VLOOKUP(tScores[[#This Row],[Name]],RRGM5,3,0),\"\")","v":""},{"$f":"IFERROR(VLOOKUP(tScores[[#This Row],[Name]],RRGM6,3,0),\"\")","v":""},{"$f":"IFERROR(VLOOKUP(tScores[[#This Row],[Name]],RRGM7,3,0),\"\")","v":""},{"$f":"SUM(tScores[[#This Row],[B1]:[B7]])","v":0},{"$f":"IFERROR(tScores[[#This Row],[Total]]+tScores[[#This Row],[RR Total]]+tScores[[#This Row],[Btotal]],\"\")","v":893.02660000000003},{"$f":"IF(tScores[[#This Row],[Name]]=\"\",\"\",RANK(tScores[[#This Row],[SUBTotal]],tScores[SUBTotal])+(COUNTIF($AA$3:$AA8,tScores[[#This Row],[SUBTotal]]))-1)","v":10},{"$f":"IFERROR(VLOOKUP(tScores[[#This Row],[Name]],RRGM8,2,0),\"\")","v":""},{"$f":"IFERROR(VLOOKUP(tScores[[#This Row],[Name]],RRGM8,3,0),\"\")","v":""},{"$f":"IFERROR(tScores[[#This Row],[SUBTotal]]+SUM(tScores[[#This Row],[RR8]:[B8]]),\"\")","v":893.02660000000003},{"$f":"IF(tScores[[#This Row],[Name]]=\"\",\"\",RANK(tScores[[#This Row],[GT]],tScores[GT])+(COUNTIF($AE$3:$AE8,tScores[[#This Row],[GT]]))-1)","v":10}]
[5,"b",{"$f":"IF(tScores[[#This Row],[Name]]=\"\",\"\",tScores[[#This Row],[Lane]]&\"-\"&tScores[[#This Row],[Pos]])","v":"5-b"},"Tyler Ladwig",215,196,176,257,{"$f":"IFERROR(IF(tScores[[#This Row],[Name]]=\"\",\"\",SUM(tScores[[#This Row],[Game1]:[Game4]]))+MAX(tScores[[#This Row],[Game1]:[Game4]])/10000,\"\")","v":844.02570000000003},{"$f":"IF(tScores[[#This Row],[Name]]=\"\",\"\",RANK(tScores[[#This Row],[Total]],tScores[Total])+(COUNTIF($I$3:$I9,tScores[[#This Row],[Total]]))-1)","v":19},{"$f":"IFERROR(VLOOKUP(tScores[[#This Row],[Name]],RRGM1,2,0),\"\")","v":""},{"$f":"IFERROR(VLOOKUP(tScores[[#This Row],[Name]],RRGM2,2,0),\"\")","v":""},{"$f":"IFERROR(VLOOKUP(tScores[[#This Row],[Name]],RRGM3,2,0),\"\")","v":""},{"$f":"IFERROR(VLOOKUP(tScores[[#This Row],[Name]],RRGM4,2,0),\"\")","v":""},{"$f":"IFERROR(VLOOKUP(tScores[[#This Row],[Name]],RRGM5,2,0),\"\")","v":""},{"$f":"IFERROR(VLOOKUP(tScores[[#This Row],[Name]],RRGM6,2,0),\"\")","v":""},{"$f":"IFERROR(VLOOKUP(tScores[[#This Row],[Name]],RRGM7,2,0),\"\")","v":""},{"$f":"SUM(tScores[[#This Row],[RR1]:[RR7]])+MAX(tScores[[#This Row],[RANK1]:[RR7]])/10000","v":1.9E-3},{"$f":"IFERROR(VLOOKUP(tScores[[#This Row],[Name]],RRGM1,3,0),\"\")","v":""},{"$f":"IFERROR(VLOOKUP(tScores[[#This Row],[Name]],RRGM2,3,0),\"\")","v":""},{"$f":"IFERROR(VLOOKUP(tScores[[#This Row],[Name]],RRGM3,3,0),\"\")","v":""},{"$f":"IFERROR(VLOOKUP(tScores[[#This Row],[Name]],RRGM4,3,0),\"\")","v":""},{"$f":"IFERROR(VLOOKUP(tScores[[#This Row],[Name]],RRGM5,3,0),\"\")","v":""},{"$f":"IFERROR(VLOOKUP(tScores[[#This Row],[Name]],RRGM6,3,0),\"\")","v":""},{"$f":"IFERROR(VLOOKUP(tScores[[#This Row],[Name]],RRGM7,3,0),\"\")","v":""},{"$f":"SUM(tScores[[#This Row],[B1]:[B7]])","v":0},{"$f":"IFERROR(tScores[[#This Row],[Total]]+tScores[[#This Row],[RR Total]]+tScores[[#This Row],[Btotal]],\"\")","v":844.02760000000001},{"$f":"IF(tScores[[#This Row],[Name]]=\"\",\"\",RANK(tScores[[#This Row],[SUBTotal]],tScores[SUBTotal])+(COUNTIF($AA$3:$AA9,tScores[[#This Row],[SUBTotal]]))-1)","v":19},{"$f":"IFERROR(VLOOKUP(tScores[[#This Row],[Name]],RRGM8,2,0),\"\")","v":""},{"$f":"IFERROR(VLOOKUP(tScores[[#This Row],[Name]],RRGM8,3,0),\"\")","v":""},{"$f":"IFERROR(tScores[[#This Row],[SUBTotal]]+SUM(tScores[[#This Row],[RR8]:[B8]]),\"\")","v":844.02760000000001},{"$f":"IF(tScores[[#This Row],[Name]]=\"\",\"\",RANK(tScores[[#This Row],[GT]],tScores[GT])+(COUNTIF($AE$3:$AE9,tScores[[#This Row],[GT]]))-1)","v":19}]
[6,"d",{"$f":"IF(tScores[[#This Row],[Name]]=\"\",\"\",tScores[[#This Row],[Lane]]&\"-\"&tScores[[#This Row],[Pos]])","v":"6-d"},"John Thomasma",241,178,239,215,{"$f":"IFERROR(IF(tScores[[#This Row],[Name]]=\"\",\"\",SUM(tScores[[#This Row],[Game1]:[Game4]]))+MAX(tScores[[#This Row],[Game1]:[Game4]])/10000,\"\")","v":873.02409999999998},{"$f":"IF(tScores[[#This Row],[Name]]=\"\",\"\",RANK(tScores[[#This Row],[Total]],tScores[Total])+(COUNTIF($I$3:$I10,tScores[[#This Row],[Total]]))-1)","v":13},{"$f":"IFERROR(VLOOKUP(tScores[[#This Row],[Name]],RRGM1,2,0),\"\")","v":""},{"$f":"IFERROR(VLOOKUP(tScores[[#This Row],[Name]],RRGM2,2,0),\"\")","v":""},{"$f":"IFERROR(VLOOKUP(tScores[[#This Row],[Name]],RRGM3,2,0),\"\")","v":""},{"$f":"IFERROR(VLOOKUP(tScores[[#This Row],[Name]],RRGM4,2,0),\"\")","v":""},{"$f":"IFERROR(VLOOKUP(tScores[[#This Row],[Name]],RRGM5,2,0),\"\")","v":""},{"$f":"IFERROR(VLOOKUP(tScores[[#This Row],[Name]],RRGM6,2,0),\"\")","v":""},{"$f":"IFERROR(VLOOKUP(tScores[[#This Row],[Name]],RRGM7,2,0),\"\")","v":""},{"$f":"SUM(tScores[[#This Row],[RR1]:[RR7]])+MAX(tScores[[#This Row],[RANK1]:[RR7]])/10000","v":1.2999999999999999E-3},{"$f":"IFERROR(VLOOKUP(tScores[[#This Row],[Name]],RRGM1,3,0),\"\")","v":""},{"$f":"IFERROR(VLOOKUP(tScores[[#This Row],[Name]],RRGM2,3,0),\"\")","v":""},{"$f":"IFERROR(VLOOKUP(tScores[[#This Row],[Name]],RRGM3,3,0),\"\")","v":""},{"$f":"IFERROR(VLOOKUP(tScores[[#This Row],[Name]],RRGM4,3,0),\"\")","v":""},{"$f":"IFERROR(VLOOKUP(tScores[[#This Row],[Name]],RRGM5,3,0),\"\")","v":""},{"$f":"IFERROR(VLOOKUP(tScores[[#This Row],[Name]],RRGM6,3,0),\"\")","v":""},{"$f":"IFERROR(VLOOKUP(tScores[[#This Row],[Name]],RRGM7,3,0),\"\")","v":""},{"$f":"SUM(tScores[[#This Row],[B1]:[B7]])","v":0},{"$f":"IFERROR(tScores[[#This Row],[Total]]+tScores[[#This Row],[RR Total]]+tScores[[#This Row],[Btotal]],\"\")","v":873.02539999999999},{"$f":"IF(tScores[[#This Row],[Name]]=\"\",\"\",RANK(tScores[[#This Row],[SUBTotal]],tScores[SUBTotal])+(COUNTIF($AA$3:$AA10,tScores[[#This Row],[SUBTotal]]))-1)","v":13},{"$f":"IFERROR(VLOOKUP(tScores[[#This Row],[Name]],RRGM8,2,0),\"\")","v":""},{"$f":"IFERROR(VLOOKUP(tScores[[#This Row],[Name]],RRGM8,3,0),\"\")","v":""},{"$f":"IFERROR(tScores[[#This Row],[SUBTotal]]+SUM(tScores[[#This Row],[RR8]:[B8]]),\"\")","v":873.02539999999999},{"$f":"IF(tScores[[#This Row],[Name]]=\"\",\"\",RANK(tScores[[#This Row],[GT]],tScores[GT])+(COUNTIF($AE$3:$AE10,tScores[[#This Row],[GT]]))-1)","v":13}]
[6,"e",{"$f":"IF(tScores[[#This Row],[Name]]=\"\",\"\",tScores[[#This Row],[Lane]]&\"-\"&tScores[[#This Row],[Pos]])","v":"6-e"},"Matt DeHaan",194,217,175,225,{"$f":"IFERROR(IF(tScores[[#This Row],[Name]]=\"\",\"\",SUM(tScores[[#This Row],[Game1]:[Game4]]))+MAX(tScores[[#This Row],[Game1]:[Game4]])/10000,\"\")","v":811.02250000000004},{"$f":"IF(tScores[[#This Row],[Name]]=\"\",\"\",RANK(tScores[[#This Row],[Total]],tScores[Total])+(COUNTIF($I$3:$I11,tScores[[#This Row],[Total]]))-1)","v":22},{"$f":"IFERROR(VLOOKUP(tScores[[#This Row],[Name]],RRGM1,2,0),\"\")","v":""},{"$f":"IFERROR(VLOOKUP(tScores[[#This Row],[Name]],RRGM2,2,0),\"\")","v":""},{"$f":"IFERROR(VLOOKUP(tScores[[#This Row],[Name]],RRGM3,2,0),\"\")","v":""},{"$f":"IFERROR(VLOOKUP(tScores[[#This Row],[Name]],RRGM4,2,0),\"\")","v":""},{"$f":"IFERROR(VLOOKUP(tScores[[#This Row],[Name]],RRGM5,2,0),\"\")","v":""},{"$f":"IFERROR(VLOOKUP(tScores[[#This Row],[Name]],RRGM6,2,0),\"\")","v":""},{"$f":"IFERROR(VLOOKUP(tScores[[#This Row],[Name]],RRGM7,2,0),\"\")","v":""},{"$f":"SUM(tScores[[#This Row],[RR1]:[RR7]])+MAX(tScores[[#This Row],[RANK1]:[RR7]])/10000","v":2.2000000000000001E-3},{"$f":"IFERROR(VLOOKUP(tScores[[#This Row],[Name]],RRGM1,3,0),\"\")","v":""},{"$f":"IFERROR(VLOOKUP(tScores[[#This Row],[Name]],RRGM2,3,0),\"\")","v":""},{"$f":"IFERROR(VLOOKUP(tScores[[#This Row],[Name]],RRGM3,3,0),\"\")","v":""},{"$f":"IFERROR(VLOOKUP(tScores[[#This Row],[Name]],RRGM4,3,0),\"\")","v":""},{"$f":"IFERROR(VLOOKUP(tScores[[#This Row],[Name]],RRGM5,3,0),\"\")","v":""},{"$f":"IFERROR(VLOOKUP(tScores[[#This Row],[Name]],RRGM6,3,0),\"\")","v":""},{"$f":"IFERROR(VLOOKUP(tScores[[#This Row],[Name]],RRGM7,3,0),\"\")","v":""},{"$f":"SUM(tScores[[#This Row],[B1]:[B7]])","v":0},{"$f":"IFERROR(tScores[[#This Row],[Total]]+tScores[[#This Row],[RR Total]]+tScores[[#This Row],[Btotal]],\"\")","v":811.02470000000005},{"$f":"IF(tScores[[#This Row],[Name]]=\"\",\"\",RANK(tScores[[#This Row],[SUBTotal]],tScores[SUBTotal])+(COUNTIF($AA$3:$AA11,tScores[[#This Row],[SUBTotal]]))-1)","v":22},{"$f":"IFERROR(VLOOKUP(tScores[[#This Row],[Name]],RRGM8,2,0),\"\")","v":""},{"$f":"IFERROR(VLOOKUP(tScores[[#This Row],[Name]],RRGM8,3,0),\"\")","v":""},{"$f":"IFERROR(tScores[[#This Row],[SUBTotal]]+SUM(tScores[[#This Row],[RR8]:[B8]]),\"\")","v":811.02470000000005},{"$f":"IF(tScores[[#This Row],[Name]]=\"\",\"\",RANK(tScores[[#This Row],[GT]],tScores[GT])+(COUNTIF($AE$3:$AE11,tScores[[#This Row],[GT]]))-1)","v":22}]
[7,"a",{"$f":"IF(tScores[[#This Row],[Name]]=\"\",\"\",tScores[[#This Row],[Lane]]&\"-\"&tScores[[#This Row],[Pos]])","v":"7-a"},"Randy Hawks",245,241,246,181,{"$f":"IFERROR(IF(tScores[[#This Row],[Name]]=\"\",\"\",SUM(tScores[[#This Row],[Game1]:[Game4]]))+MAX(tScores[[#This Row],[Game1]:[Game4]])/10000,\"\")","v":913.02459999999996},{"$f":"IF(tScores[[#This Row],[Name]]=\"\",\"\",RANK(tScores[[#This Row],[Total]],tScores[Total])+(COUNTIF($I$3:$I12,tScores[[#This Row],[Total]]))-1)","v":9},{"$f":"IFERROR(VLOOKUP(tScores[[#This Row],[Name]],RRGM1,2,0),\"\")","v":""},{"$f":"IFERROR(VLOOKUP(tScores[[#This Row],[Name]],RRGM2,2,0),\"\")","v":""},{"$f":"IFERROR(VLOOKUP(tScores[[#This Row],[Name]],RRGM3,2,0),\"\")","v":""},{"$f":"IFERROR(VLOOKUP(tScores[[#This Row],[Name]],RRGM4,2,0),\"\")","v":""},{"$f":"IFERROR(VLOOKUP(tScores[[#This Row],[Name]],RRGM5,2,0),\"\")","v":""},{"$f":"IFERROR(VLOOKUP(tScores[[#This Row],[Name]],RRGM6,2,0),\"\")","v":""},{"$f":"IFERROR(VLOOKUP(tScores[[#This Row],[Name]],RRGM7,2,0),\"\")","v":""},{"$f":"SUM(tScores[[#This Row],[RR1]:[RR7]])+MAX(tScores[[#This Row],[RANK1]:[RR7]])/10000","v":8.9999999999999998E-4},{"$f":"IFERROR(VLOOKUP(tScores[[#This Row],[Name]],RRGM1,3,0),\"\")","v":""},{"$f":"IFERROR(VLOOKUP(tScores[[#This Row],[Name]],RRGM2,3,0),\"\")","v":""},{"$f":"IFERROR(VLOOKUP(tScores[[#This Row],[Name]],RRGM3,3,0),\"\")","v":""},{"$f":"IFERROR(VLOOKUP(tScores[[#This Row],[Name]],RRGM4,3,0),\"\")","v":""},{"$f":"IFERROR(VLOOKUP(tScores[[#This Row],[Name]],RRGM5,3,0),\"\")","v":""},{"$f":"IFERROR(VLOOKUP(tScores[[#This Row],[Name]],RRGM6,3,0),\"\")","v":""},{"$f":"IFERROR(VLOOKUP(tScores[[#This Row],[Name]],RRGM7,3,0),\"\")","v":""},{"$f":"SUM(tScores[[#This Row],[B1]:[B7]])","v":0},{"$f":"IFERROR(tScores[[#This Row],[Total]]+tScores[[#This Row],[RR Total]]+tScores[[#This Row],[Btotal]],\"\")","v":913.02549999999997},{"$f":"IF(tScores[[#This Row],[Name]]=\"\",\"\",RANK(tScores[[#This Row],[SUBTotal]],tScores[SUBTotal])+(COUNTIF($AA$3:$AA12,tScores[[#This Row],[SUBTotal]]))-1)","v":9},{"$f":"IFERROR(VLOOKUP(tScores[[#This Row],[Name]],RRGM8,2,0),\"\")","v":""},{"$f":"IFERROR(VLOOKUP(tScores[[#This Row],[Name]],RRGM8,3,0),\"\")","v":""},{"$f":"IFERROR(tScores[[#This Row],[SUBTotal]]+SUM(tScores[[#This Row],[RR8]:[B8]]),\"\")","v":913.02549999999997},{"$f":"IF(tScores[[#This Row],[Name]]=\"\",\"\",RANK(tScores[[#This Row],[GT]],tScores[GT])+(COUNTIF($AE$3:$AE12,tScores[[#This Row],[GT]]))-1)","v":9}]
[7,"b",{"$f":"IF(tScores[[#This Row],[Name]]=\"\",\"\",tScores[[#This Row],[Lane]]&\"-\"&tScores[[#This Row],[Pos]])","v":"7-b"},"Derek  Nyenhuis",213,208,228,191,{"$f":"IFERROR(IF(tScores[[#This Row],[Name]]=\"\",\"\",SUM(tScores[[#This Row],[Game1]:[Game4]]))+MAX(tScores[[#This Row],[Game1]:[Game4]])/10000,\"\")","v":840.02279999999996},{"$f":"IF(tScores[[#This Row],[Name]]=\"\",\"\",RANK(tScores[[#This Row],[Total]],tScores[Total])+(COUNTIF($I$3:$I13,tScores[[#This Row],[Total]]))-1)","v":20},{"$f":"IFERROR(VLOOKUP(tScores[[#This Row],[Name]],RRGM1,2,0),\"\")","v":""},{"$f":"IFERROR(VLOOKUP(tScores[[#This Row],[Name]],RRGM2,2,0),\"\")","v":""},{"$f":"IFERROR(VLOOKUP(tScores[[#This Row],[Name]],RRGM3,2,0),\"\")","v":""},{"$f":"IFERROR(VLOOKUP(tScores[[#This Row],[Name]],RRGM4,2,0),\"\")","v":""},{"$f":"IFERROR(VLOOKUP(tScores[[#This Row],[Name]],RRGM5,2,0),\"\")","v":""},{"$f":"IFERROR(VLOOKUP(tScores[[#This Row],[Name]],RRGM6,2,0),\"\")","v":""},{"$f":"IFERROR(VLOOKUP(tScores[[#This Row],[Name]],RRGM7,2,0),\"\")","v":""},{"$f":"SUM(tScores[[#This Row],[RR1]:[RR7]])+MAX(tScores[[#This Row],[RANK1]:[RR7]])/10000","v":2E-3},{"$f":"IFERROR(VLOOKUP(tScores[[#This Row],[Name]],RRGM1,3,0),\"\")","v":""},{"$f":"IFERROR(VLOOKUP(tScores[[#This Row],[Name]],RRGM2,3,0),\"\")","v":""},{"$f":"IFERROR(VLOOKUP(tScores[[#This Row],[Name]],RRGM3,3,0),\"\")","v":""},{"$f":"IFERROR(VLOOKUP(tScores[[#This Row],[Name]],RRGM4,3,0),\"\")","v":""},{"$f":"IFERROR(VLOOKUP(tScores[[#This Row],[Name]],RRGM5,3,0),\"\")","v":""},{"$f":"IFERROR(VLOOKUP(tScores[[#This Row],[Name]],RRGM6,3,0),\"\")","v":""},{"$f":"IFERROR(VLOOKUP(tScores[[#This Row],[Name]],RRGM7,3,0),\"\")","v":""},{"$f":"SUM(tScores[[#This Row],[B1]:[B7]])","v":0},{"$f":"IFERROR(tScores[[#This Row],[Total]]+tScores[[#This Row],[RR Total]]+tScores[[#This Row],[Btotal]],\"\")","v":840.02479999999991},{"$f":"IF(tScores[[#This Row],[Name]]=\"\",\"\",RANK(tScores[[#This Row],[SUBTotal]],tScores[SUBTotal])+(COUNTIF($AA$3:$AA13,tScores[[#This Row],[SUBTotal]]))-1)","v":20},{"$f":"IFERROR(VLOOKUP(tScores[[#This Row],[Name]],RRGM8,2,0),\"\")","v":""},{"$f":"IFERROR(VLOOKUP(tScores[[#This Row],[Name]],RRGM8,3,0),\"\")","v":""},{"$f":"IFERROR(tScores[[#This Row],[SUBTotal]]+SUM(tScores[[#This Row],[RR8]:[B8]]),\"\")","v":840.02479999999991},{"$f":"IF(tScores[[#This Row],[Name]]=\"\",\"\",RANK(tScores[[#This Row],[GT]],tScores[GT])+(COUNTIF($AE$3:$AE13,tScores[[#This Row],[GT]]))-1)","v":20}]
[8,"d",{"$f":"IF(tScores[[#This Row],[Name]]=\"\",\"\",tScores[[#This Row],[Lane]]&\"-\"&tScores[[#This Row],[Pos]])","v":"8-d"},"Mike Horian",216,268,210,224,{"$f":"IFERROR(IF(tScores[[#This Row],[Name]]=\"\",\"\",SUM(tScores[[#This Row],[Game1]:[Game4]]))+MAX(tScores[[#This Row],[Game1]:[Game4]])/10000,\"\")","v":918.02679999999998},{"$f":"IF(tScores[[#This Row],[Name]]=\"\",\"\",RANK(tScores[[#This Row],[Total]],tScores[Total])+(COUNTIF($I$3:$I14,tScores[[#This Row],[Total]]))-1)","v":8},{"$f":"IFERROR(VLOOKUP(tScores[[#This Row],[Name]],RRGM1,2,0),\"\")","v":151},{"$f":"IFERROR(VLOOKUP(tScores[[#This Row],[Name]],RRGM2,2,0),\"\")","v":223},{"$f":"IFERROR(VLOOKUP(tScores[[#This Row],[Name]],RRGM3,2,0),\"\")","v":179},{"$f":"IFERROR(VLOOKUP(tScores[[#This Row],[Name]],RRGM4,2,0),\"\")","v":204},{"$f":"IFERROR(VLOOKUP(tScores[[#This Row],[Name]],RRGM5,2,0),\"\")","v":238},{"$f":"IFERROR(VLOOKUP(tScores[[#This Row],[Name]],RRGM6,2,0),\"\")","v":252},{"$f":"IFERROR(VLOOKUP(tScores[[#This Row],[Name]],RRGM7,2,0),\"\")","v":224},{"$f":"SUM(tScores[[#This Row],[RR1]:[RR7]])+MAX(tScores[[#This Row],[RANK1]:[RR7]])/10000","v":1471.0252},{"$f":"IFERROR(VLOOKUP(tScores[[#This Row],[Name]],RRGM1,3,0),\"\")","v":0},{"$f":"IFERROR(VLOOKUP(tScores[[#This Row],[Name]],RRGM2,3,0),\"\")","v":30},{"$f":"IFERROR(VLOOKUP(tScores[[#This Row],[Name]],RRGM3,3,0),\"\")","v":30},{"$f":"IFERROR(VLOOKUP(tScores[[#This Row],[Name]],RRGM4,3,0),\"\")","v":0},{"$f":"IFERROR(VLOOKUP(tScores[[#This Row],[Name]],RRGM5,3,0),\"\")","v":30},{"$f":"IFERROR(VLOOKUP(tScores[[#This Row],[Name]],RRGM6,3,0),\"\")","v":30},{"$f":"IFERROR(VLOOKUP(tScores[[#This Row],[Name]],RRGM7,3,0),\"\")","v":0},{"$f":"SUM(tScores[[#This Row],[B1]:[B7]])","v":120},{"$f":"IFERROR(tScores[[#This Row],[Total]]+tScores[[#This Row],[RR Total]]+tScores[[#This Row],[Btotal]],\"\")","v":2509.0520000000001},{"$f":"IF(tScores[[#This Row],[Name]]=\"\",\"\",RANK(tScores[[#This Row],[SUBTotal]],tScores[SUBTotal])+(COUNTIF($AA$3:$AA14,tScores[[#This Row],[SUBTotal]]))-1)","v":5},{"$f":"IFERROR(VLOOKUP(tScores[[#This Row],[Name]],RRGM8,2,0),\"\")","v":180},{"$f":"IFERROR(VLOOKUP(tScores[[#This Row],[Name]],RRGM8,3,0),\"\")","v":0},{"$f":"IFERROR(tScores[[#This Row],[SUBTotal]]+SUM(tScores[[#This Row],[RR8]:[B8]]),\"\")","v":2689.0520000000001},{"$f":"IF(tScores[[#This Row],[Name]]=\"\",\"\",RANK(tScores[[#This Row],[GT]],tScores[GT])+(COUNTIF($AE$3:$AE14,tScores[[#This Row],[GT]]))-1)","v":6}]
[8,"e",{"$f":"IF(tScores[[#This Row],[Name]]=\"\",\"\",tScores[[#This Row],[Lane]]&\"-\"&tScores[[#This Row],[Pos]])","v":"8-e"},"Jordan Kaufman",247,220,198,190,{"$f":"IFERROR(IF(tScores[[#This Row],[Name]]=\"\",\"\",SUM(tScores[[#This Row],[Game1]:[Game4]]))+MAX(tScores[[#This Row],[Game1]:[Game4]])/10000,\"\")","v":855.02470000000005},{"$f":"IF(tScores[[#This Row],[Name]]=\"\",\"\",RANK(tScores[[#This Row],[Total]],tScores[Total])+(COUNTIF($I$3:$I15,tScores[[#This Row],[Total]]))-1)","v":18},{"$f":"IFERROR(VLOOKUP(tScores[[#This Row],[Name]],RRGM1,2,0),\"\")","v":""},{"$f":"IFERROR(VLOOKUP(tScores[[#This Row],[Name]],RRGM2,2,0),\"\")","v":""},{"$f":"IFERROR(VLOOKUP(tScores[[#This Row],[Name]],RRGM3,2,0),\"\")","v":""},{"$f":"IFERROR(VLOOKUP(tScores[[#This Row],[Name]],RRGM4,2,0),\"\")","v":""},{"$f":"IFERROR(VLOOKUP(tScores[[#This Row],[Name]],RRGM5,2,0),\"\")","v":""},{"$f":"IFERROR(VLOOKUP(tScores[[#This Row],[Name]],RRGM6,2,0),\"\")","v":""},{"$f":"IFERROR(VLOOKUP(tScores[[#This Row],[Name]],RRGM7,2,0),\"\")","v":""},{"$f":"SUM(tScores[[#This Row],[RR1]:[RR7]])+MAX(tScores[[#This Row],[RANK1]:[RR7]])/10000","v":1.8E-3},{"$f":"IFERROR(VLOOKUP(tScores[[#This Row],[Name]],RRGM1,3,0),\"\")","v":""},{"$f":"IFERROR(VLOOKUP(tScores[[#This Row],[Name]],RRGM2,3,0),\"\")","v":""},{"$f":"IFERROR(VLOOKUP(tScores[[#This Row],[Name]],RRGM3,3,0),\"\")","v":""},{"$f":"IFERROR(VLOOKUP(tScores[[#This Row],[Name]],RRGM4,3,0),\"\")","v":""},{"$f":"IFERROR(VLOOKUP(tScores[[#This Row],[Name]],RRGM5,3,0),\"\")","v":""},{"$f":"IFERROR(VLOOKUP(tScores[[#This Row],[Name]],RRGM6,3,0),\"\")","v":""},{"$f":"IFERROR(VLOOKUP(tScores[[#This Row],[Name]],RRGM7,3,0),\"\")","v":""},{"$f":"SUM(tScores[[#This Row],[B1]:[B7]])","v":0},{"$f":"IFERROR(tScores[[#This Row],[Total]]+tScores[[#This Row],[RR Total]]+tScores[[#This Row],[Btotal]],\"\")","v":855.02650000000006},{"$f":"IF(tScores[[#This Row],[Name]]=\"\",\"\",RANK(tScores[[#This Row],[SUBTotal]],tScores[SUBTotal])+(COUNTIF($AA$3:$AA15,tScores[[#This Row],[SUBTotal]]))-1)","v":18},{"$f":"IFERROR(VLOOKUP(tScores[[#This Row],[Name]],RRGM8,2,0),\"\")","v":""},{"$f":"IFERROR(VLOOKUP(tScores[[#This Row],[Name]],RRGM8,3,0),\"\")","v":""},{"$f":"IFERROR(tScores[[#This Row],[SUBTotal]]+SUM(tScores[[#This Row],[RR8]:[B8]]),\"\")","v":855.02650000000006},{"$f":"IF(tScores[[#This Row],[Name]]=\"\",\"\",RANK(tScores[[#This Row],[GT]],tScores[GT])+(COUNTIF($AE$3:$AE15,tScores[[#This Row],[GT]]))-1)","v":18}]
[9,"a",{"$f":"IF(tScores[[#This Row],[Name]]=\"\",\"\",tScores[[#This Row],[Lane]]&\"-\"&tScores[[#This Row],[Pos]])","v":"9-a"},"Tom Morgan",191,191,202,213,{"$f":"IFERROR(IF(tScores[[#This Row],[Name]]=\"\",\"\",SUM(tScores[[#This Row],[Game1]:[Game4]]))+MAX(tScores[[#This Row],[Game1]:[Game4]])/10000,\"\")","v":797.0213},{"$f":"IF(tScores[[#This Row],[Name]]=\"\",\"\",RANK(tScores[[#This Row],[Total]],tScores[Total])+(COUNTIF($I$3:$I16,tScores[[#This Row],[Total]]))-1)","v":24},{"$f":"IFERROR(VLOOKUP(tScores[[#This Row],[Name]],RRGM1,2,0),\"\")","v":""},{"$f":"IFERROR(VLOOKUP(tScores[[#This Row],[Name]],RRGM2,2,0),\"\")","v":""},{"$f":"IFERROR(VLOOKUP(tScores[[#This Row],[Name]],RRGM3,2,0),\"\")","v":""},{"$f":"IFERROR(VLOOKUP(tScores[[#This Row],[Name]],RRGM4,2,0),\"\")","v":""},{"$f":"IFERROR(VLOOKUP(tScores[[#This Row],[Name]],RRGM5,2,0),\"\")","v":""},{"$f":"IFERROR(VLOOKUP(tScores[[#This Row],[Name]],RRGM6,2,0),\"\")","v":""},{"$f":"IFERROR(VLOOKUP(tScores[[#This Row],[Name]],RRGM7,2,0),\"\")","v":""},{"$f":"SUM(tScores[[#This Row],[RR1]:[RR7]])+MAX(tScores[[#This Row],[RANK1]:[RR7]])/10000","v":2.3999999999999998E-3},{"$f":"IFERROR(VLOOKUP(tScores[[#This Row],[Name]],RRGM1,3,0),\"\")","v":""},{"$f":"IFERROR(VLOOKUP(tScores[[#This Row],[Name]],RRGM2,3,0),\"\")","v":""},{"$f":"IFERROR(VLOOKUP(tScores[[#This Row],[Name]],RRGM3,3,0),\"\")","v":""},{"$f":"IFERROR(VLOOKUP(tScores[[#This Row],[Name]],RRGM4,3,0),\"\")","v":""},{"$f":"IFERROR(VLOOKUP(tScores[[#This Row],[Name]],RRGM5,3,0),\"\")","v":""},{"$f":"IFERROR(VLOOKUP(tScores[[#This Row],[Name]],RRGM6,3,0),\"\")","v":""},{"$f":"IFERROR(VLOOKUP(tScores[[#This Row],[Name]],RRGM7,3,0),\"\")","v":""},{"$f":"SUM(tScores[[#This Row],[B1]:[B7]])","v":0},{"$f":"IFERROR(tScores[[#This Row],[Total]]+tScores[[#This Row],[RR Total]]+tScores[[#This Row],[Btotal]],\"\")","v":797.02369999999996},{"$f":"IF(tScores[[#This Row],[Name]]=\"\",\"\",RANK(tScores[[#This Row],[SUBTotal]],tScores[SUBTotal])+(COUNTIF($AA$3:$AA16,tScores[[#This Row],[SUBTotal]]))-1)","v":24},{"$f":"IFERROR(VLOOKUP(tScores[[#This Row],[Name]],RRGM8,2,0),\"\")","v":""},{"$f":"IFERROR(VLOOKUP(tScores[[#This Row],[Name]],RRGM8,3,0),\"\")","v":""},{"$f":"IFERROR(tScores[[#This Row],[SUBTotal]]+SUM(tScores[[#This Row],[RR8]:[B8]]),\"\")","v":797.02369999999996},{"$f":"IF(tScores[[#This Row],[Name]]=\"\",\"\",RANK(tScores[[#This Row],[GT]],tScores[GT])+(COUNTIF($AE$3:$AE16,tScores[[#This Row],[GT]]))-1)","v":24}]
[9,"b",{"$f":"IF(tScores[[#This Row],[Name]]=\"\",\"\",tScores[[#This Row],[Lane]]&\"-\"&tScores[[#This Row],[Pos]])","v":"9-b"},"Tim Huizinga",160,193,180,235,{"$f":"IFERROR(IF(tScores[[#This Row],[Name]]=\"\",\"\",SUM(tScores[[#This Row],[Game1]:[Game4]]))+MAX(tScores[[#This Row],[Game1]:[Game4]])/10000,\"\")","v":768.02350000000001},{"$f":"IF(tScores[[#This Row],[Name]]=\"\",\"\",RANK(tScores[[#This Row],[Total]],tScores[Total])+(COUNTIF($I$3:$I17,tScores[[#This Row],[Total]]))-1)","v":30},{"$f":"IFERROR(VLOOKUP(tScores[[#This Row],[Name]],RRGM1,2,0),\"\")","v":""},{"$f":"IFERROR(VLOOKUP(tScores[[#This Row],[Name]],RRGM2,2,0),\"\")","v":""},{"$f":"IFERROR(VLOOKUP(tScores[[#This Row],[Name]],RRGM3,2,0),\"\")","v":""},{"$f":"IFERROR(VLOOKUP(tScores[[#This Row],[Name]],RRGM4,2,0),\"\")","v":""},{"$f":"IFERROR(VLOOKUP(tScores[[#This Row],[Name]],RRGM5,2,0),\"\")","v":""},{"$f":"IFERROR(VLOOKUP(tScores[[#This Row],[Name]],RRGM6,2,0),\"\")","v":""},{"$f":"IFERROR(VLOOKUP(tScores[[#This Row],[Name]],RRGM7,2,0),\"\")","v":""},{"$f":"SUM(tScores[[#This Row],[RR1]:[RR7]])+MAX(tScores[[#This Row],[RANK1]:[RR7]])/10000","v":3.0000000000000001E-3},{"$f":"IFERROR(VLOOKUP(tScores[[#This Row],[Name]],RRGM1,3,0),\"\")","v":""},{"$f":"IFERROR(VLOOKUP(tScores[[#This Row],[Name]],RRGM2,3,0),\"\")","v":""},{"$f":"IFERROR(VLOOKUP(tScores[[#This Row],[Name]],RRGM3,3,0),\"\")","v":""},{"$f":"IFERROR(VLOOKUP(tScores[[#This Row],[Name]],RRGM4,3,0),\"\")","v":""},{"$f":"IFERROR(VLOOKUP(tScores[[#This Row],[Name]],RRGM5,3,0),\"\")","v":""},{"$f":"IFERROR(VLOOKUP(tScores[[#This Row],[Name]],RRGM6,3,0),\"\")","v":""},{"$f":"IFERROR(VLOOKUP(tScores[[#This Row],[Name]],RRGM7,3,0),\"\")","v":""},{"$f":"SUM(tScores[[#This Row],[B1]:[B7]])","v":0},{"$f":"IFERROR(tScores[[#This Row],[Total]]+tScores[[#This Row],[RR Total]]+tScores[[#This Row],[Btotal]],\"\")","v":768.02650000000006},{"$f":"IF(tScores[[#This Row],[Name]]=\"\",\"\",RANK(tScores[[#This Row],[SUBTotal]],tScores[SUBTotal])+(COUNTIF($AA$3:$AA17,tScores[[#This Row],[SUBTotal]]))-1)","v":30},{"$f":"IFERROR(VLOOKUP(tScores[[#This Row],[Name]],RRGM8,2,0),\"\")","v":""},{"$f":"IFERROR(VLOOKUP(tScores[[#This Row],[Name]],RRGM8,3,0),\"\")","v":""},{"$f":"IFERROR(tScores[[#This Row],[SUBTotal]]+SUM(tScores[[#This Row],[RR8]:[B8]]),\"\")","v":768.02650000000006},{"$f":"IF(tScores[[#This Row],[Name]]=\"\",\"\",RANK(tScores[[#This Row],[GT]],tScores[GT])+(COUNTIF($AE$3:$AE17,tScores[[#This Row],[GT]]))-1)","v":30}]
[10,"d",{"$f":"IF(tScores[[#This Row],[Name]]=\"\",\"\",tScores[[#This Row],[Lane]]&\"-\"&tScores[[#This Row],[Pos]])","v":"10-d"},"Aaron Groendyk",234,269,226,208,{"$f":"IFERROR(IF(tScores[[#This Row],[Name]]=\"\",\"\",SUM(tScores[[#This Row],[Game1]:[Game4]]))+MAX(tScores[[#This Row],[Game1]:[Game4]])/10000,\"\")","v":937.02689999999996},{"$f":"IF(tScores[[#This Row],[Name]]=\"\",\"\",RANK(tScores[[#This Row],[Total]],tScores[Total])+(COUNTIF($I$3:$I18,tScores[[#This Row],[Total]]))-1)","v":4},{"$f":"IFERROR(VLOOKUP(tScores[[#This Row],[Name]],RRGM1,2,0),\"\")","v":257},{"$f":"IFERROR(VLOOKUP(tScores[[#This Row],[Name]],RRGM2,2,0),\"\")","v":216},{"$f":"IFERROR(VLOOKUP(tScores[[#This Row],[Name]],RRGM3,2,0),\"\")","v":245},{"$f":"IFERROR(VLOOKUP(tScores[[#This Row],[Name]],RRGM4,2,0),\"\")","v":217},{"$f":"IFERROR(VLOOKUP(tScores[[#This Row],[Name]],RRGM5,2,0),\"\")","v":227},{"$f":"IFERROR(VLOOKUP(tScores[[#This Row],[Name]],RRGM6,2,0),\"\")","v":181},{"$f":"IFERROR(VLOOKUP(tScores[[#This Row],[Name]],RRGM7,2,0),\"\")","v":215},{"$f":"SUM(tScores[[#This Row],[RR1]:[RR7]])+MAX(tScores[[#This Row],[RANK1]:[RR7]])/10000","v":1558.0256999999999},{"$f":"IFERROR(VLOOKUP(tScores[[#This Row],[Name]],RRGM1,3,0),\"\")","v":30},{"$f":"IFERROR(VLOOKUP(tScores[[#This Row],[Name]],RRGM2,3,0),\"\")","v":0},{"$f":"IFERROR(VLOOKUP(tScores[[#This Row],[Name]],RRGM3,3,0),\"\")","v":30},{"$f":"IFERROR(VLOOKUP(tScores[[#This Row],[Name]],RRGM4,3,0),\"\")","v":30},{"$f":"IFERROR(VLOOKUP(tScores[[#This Row],[Name]],RRGM5,3,0),\"\")","v":30},{"$f":"IFERROR(VLOOKUP(tScores[[#This Row],[Name]],RRGM6,3,0),\"\")","v":0},{"$f":"IFERROR(VLOOKUP(tScores[[#This Row],[Name]],RRGM7,3,0),\"\")","v":0},{"$f":"SUM(tScores[[#This Row],[B1]:[B7]])","v":120},{"$f":"IFERROR(tScores[[#This Row],[Total]]+tScores[[#This Row],[RR Total]]+tScores[[#This Row],[Btotal]],\"\")","v":2615.0526},{"$f":"IF(tScores[[#This Row],[Name]]=\"\",\"\",RANK(tScores[[#This Row],[SUBTotal]],tScores[SUBTotal])+(COUNTIF($AA$3:$AA18,tScores[[#This Row],[SUBTotal]]))-1)","v":2},{"$f":"IFERROR(VLOOKUP(tScores[[#This Row],[Name]],RRGM8,2,0),\"\")","v":222},{"$f":"IFERROR(VLOOKUP(tScores[[#This Row],[Name]],RRGM8,3,0),\"\")","v":30},{"$f":"IFERROR(tScores[[#This Row],[SUBTotal]]+SUM(tScores[[#This Row],[RR8]:[B8]]),\"\")","v":2867.0526},{"$f":"IF(tScores[[#This Row],[Name]]=\"\",\"\",RANK(tScores[[#This Row],[GT]],tScores[GT])+(COUNTIF($AE$3:$AE18,tScores[[#This Row],[GT]]))-1)","v":2}]
[10,"e",{"$f":"IF(tScores[[#This Row],[Name]]=\"\",\"\",tScores[[#This Row],[Lane]]&\"-\"&tScores[[#This Row],[Pos]])","v":"10-e"},"Eric Scott",257,238,268,211,{"$f":"IFERROR(IF(tScores[[#This Row],[Name]]=\"\",\"\",SUM(tScores[[#This Row],[Game1]:[Game4]]))+MAX(tScores[[#This Row],[Game1]:[Game4]])/10000,\"\")","v":974.02679999999998},{"$f":"IF(tScores[[#This Row],[Name]]=\"\",\"\",RANK(tScores[[#This Row],[Total]],tScores[Total])+(COUNTIF($I$3:$I19,tScores[[#This Row],[Total]]))-1)","v":3},{"$f":"IFERROR(VLOOKUP(tScores[[#This Row],[Name]],RRGM1,2,0),\"\")","v":216},{"$f":"IFERROR(VLOOKUP(tScores[[#This Row],[Name]],RRGM2,2,0),\"\")","v":174},{"$f":"IFERROR(VLOOKUP(tScores[[#This Row],[Name]],RRGM3,2,0),\"\")","v":172},{"$f":"IFERROR(VLOOKUP(tScores[[#This Row],[Name]],RRGM4,2,0),\"\")","v":170},{"$f":"IFERROR(VLOOKUP(tScores[[#This Row],[Name]],RRGM5,2,0),\"\")","v":232},{"$f":"IFERROR(VLOOKUP(tScores[[#This Row],[Name]],RRGM6,2,0),\"\")","v":182},{"$f":"IFERROR(VLOOKUP(tScores[[#This Row],[Name]],RRGM7,2,0),\"\")","v":147},{"$f":"SUM(tScores[[#This Row],[RR1]:[RR7]])+MAX(tScores[[#This Row],[RANK1]:[RR7]])/10000","v":1293.0232000000001},{"$f":"IFERROR(VLOOKUP(tScores[[#This Row],[Name]],RRGM1,3,0),\"\")","v":0},{"$f":"IFERROR(VLOOKUP(tScores[[#This Row],[Name]],RRGM2,3,0),\"\")","v":0},{"$f":"IFERROR(VLOOKUP(tScores[[#This Row],[Name]],RRGM3,3,0),\"\")","v":0},{"$f":"IFERROR(VLOOKUP(tScores[[#This Row],[Name]],RRGM4,3,0),\"\")","v":0},{"$f":"IFERROR(VLOOKUP(tScores[[#This Row],[Name]],RRGM5,3,0),\"\")","v":0},{"$f":"IFERROR(VLOOKUP(tScores[[#This Row],[Name]],RRGM6,3,0),\"\")","v":0},{"$f":"IFERROR(VLOOKUP(tScores[[#This Row],[Name]],RRGM7,3,0),\"\")","v":0},{"$f":"SUM(tScores[[#This Row],[B1]:[B7]])","v":0},{"$f":"IFERROR(tScores[[#This Row],[Total]]+tScores[[#This Row],[RR Total]]+tScores[[#This Row],[Btotal]],\"\")","v":2267.0500000000002},{"$f":"IF(tScores[[#This Row],[Name]]=\"\",\"\",RANK(tScores[[#This Row],[SUBTotal]],tScores[SUBTotal])+(COUNTIF($AA$3:$AA19,tScores[[#This Row],[SUBTotal]]))-1)","v":8},{"$f":"IFERROR(VLOOKUP(tScores[[#This Row],[Name]],RRGM8,2,0),\"\")","v":151},{"$f":"IFERROR(VLOOKUP(tScores[[#This Row],[Name]],RRGM8,3,0),\"\")","v":0},{"$f":"IFERROR(tScores[[#This Row],[SUBTotal]]+SUM(tScores[[#This Row],[RR8]:[B8]]),\"\")","v":2418.0500000000002},{"$f":"IF(tScores[[#This Row],[Name]]=\"\",\"\",RANK(tScores[[#This Row],[GT]],tScores[GT])+(COUNTIF($AE$3:$AE19,tScores[[#This Row],[GT]]))-1)","v":8}]
[11,"a",{"$f":"IF(tScores[[#This Row],[Name]]=\"\",\"\",tScores[[#This Row],[Lane]]&\"-\"&tScores[[#This Row],[Pos]])","v":"11-a"},"Mel Atkins",190,226,147,193,{"$f":"IFERROR(IF(tScores[[#This Row],[Name]]=\"\",\"\",SUM(tScores[[#This Row],[Game1]:[Game4]]))+MAX(tScores[[#This Row],[Game1]:[Game4]])/10000,\"\")","v":756.02260000000001},{"$f":"IF(tScores[[#This Row],[Name]]=\"\",\"\",RANK(tScores[[#This Row],[Total]],tScores[Total])+(COUNTIF($I$3:$I20,tScores[[#This Row],[Total]]))-1)","v":32},{"$f":"IFERROR(VLOOKUP(tScores[[#This Row],[Name]],RRGM1,2,0),\"\")","v":""},{"$f":"IFERROR(VLOOKUP(tScores[[#This Row],[Name]],RRGM2,2,0),\"\")","v":""},{"$f":"IFERROR(VLOOKUP(tScores[[#This Row],[Name]],RRGM3,2,0),\"\")","v":""},{"$f":"IFERROR(VLOOKUP(tScores[[#This Row],[Name]],RRGM4,2,0),\"\")","v":""},{"$f":"IFERROR(VLOOKUP(tScores[[#This Row],[Name]],RRGM5,2,0),\"\")","v":""},{"$f":"IFERROR(VLOOKUP(tScores[[#This Row],[Name]],RRGM6,2,0),\"\")","v":""},{"$f":"IFERROR(VLOOKUP(tScores[[#This Row],[Name]],RRGM7,2,0),\"\")","v":""},{"$f":"SUM(tScores[[#This Row],[RR1]:[RR7]])+MAX(tScores[[#This Row],[RANK1]:[RR7]])/10000","v":3.2000000000000002E-3},{"$f":"IFERROR(VLOOKUP(tScores[[#This Row],[Name]],RRGM1,3,0),\"\")","v":""},{"$f":"IFERROR(VLOOKUP(tScores[[#This Row],[Name]],RRGM2,3,0),\"\")","v":""},{"$f":"IFERROR(VLOOKUP(tScores[[#This Row],[Name]],RRGM3,3,0),\"\")","v":""},{"$f":"IFERROR(VLOOKUP(tScores[[#This Row],[Name]],RRGM4,3,0),\"\")","v":""},{"$f":"IFERROR(VLOOKUP(tScores[[#This Row],[Name]],RRGM5,3,0),\"\")","v":""},{"$f":"IFERROR(VLOOKUP(tScores[[#This Row],[Name]],RRGM6,3,0),\"\")","v":""},{"$f":"IFERROR(VLOOKUP(tScores[[#This Row],[Name]],RRGM7,3,0),\"\")","v":""},{"$f":"SUM(tScores[[#This Row],[B1]:[B7]])","v":0},{"$f":"IFERROR(tScores[[#This Row],[Total]]+tScores[[#This Row],[RR Total]]+tScores[[#This Row],[Btotal]],\"\")","v":756.0258},{"$f":"IF(tScores[[#This Row],[Name]]=\"\",\"\",RANK(tScores[[#This Row],[SUBTotal]],tScores[SUBTotal])+(COUNTIF($AA$3:$AA20,tScores[[#This Row],[SUBTotal]]))-1)","v":32},{"$f":"IFERROR(VLOOKUP(tScores[[#This Row],[Name]],RRGM8,2,0),\"\")","v":""},{"$f":"IFERROR(VLOOKUP(tScores[[#This Row],[Name]],RRGM8,3,0),\"\")","v":""},{"$f":"IFERROR(tScores[[#This Row],[SUBTotal]]+SUM(tScores[[#This Row],[RR8]:[B8]]),\"\")","v":756.0258},{"$f":"IF(tScores[[#This Row],[Name]]=\"\",\"\",RANK(tScores[[#This Row],[GT]],tScores[GT])+(COUNTIF($AE$3:$AE20,tScores[[#This Row],[GT]]))-1)","v":32}]
[11,"b",{"$f":"IF(tScores[[#This Row],[Name]]=\"\",\"\",tScores[[#This Row],[Lane]]&\"-\"&tScores[[#This Row],[Pos]])","v":"11-b"},"Dan Bailey",197,215,179,210,{"$f":"IFERROR(IF(tScores[[#This Row],[Name]]=\"\",\"\",SUM(tScores[[#This Row],[Game1]:[Game4]]))+MAX(tScores[[#This Row],[Game1]:[Game4]])/10000,\"\")","v":801.02149999999995},{"$f":"IF(tScores[[#This Row],[Name]]=\"\",\"\",RANK(tScores[[#This Row],[Total]],tScores[Total])+(COUNTIF($I$3:$I21,tScores[[#This Row],[Total]]))-1)","v":23},{"$f":"IFERROR(VLOOKUP(tScores[[#This Row],[Name]],RRGM1,2,0),\"\")","v":""},{"$f":"IFERROR(VLOOKUP(tScores[[#This Row],[Name]],RRGM2,2,0),\"\")","v":""},{"$f":"IFERROR(VLOOKUP(tScores[[#This Row],[Name]],RRGM3,2,0),\"\")","v":""},{"$f":"IFERROR(VLOOKUP(tScores[[#This Row],[Name]],RRGM4,2,0),\"\")","v":""},{"$f":"IFERROR(VLOOKUP(tScores[[#This Row],[Name]],RRGM5,2,0),\"\")","v":""},{"$f":"IFERROR(VLOOKUP(tScores[[#This Row],[Name]],RRGM6,2,0),\"\")","v":""},{"$f":"IFERROR(VLOOKUP(tScores[[#This Row],[Name]],RRGM7,2,0),\"\")","v":""},{"$f":"SUM(tScores[[#This Row],[RR1]:[RR7]])+MAX(tScores[[#This Row],[RANK1]:[RR7]])/10000","v":2.3E-3},{"$f":"IFERROR(VLOOKUP(tScores[[#This Row],[Name]],RRGM1,3,0),\"\")","v":""},{"$f":"IFERROR(VLOOKUP(tScores[[#This Row],[Name]],RRGM2,3,0),\"\")","v":""},{"$f":"IFERROR(VLOOKUP(tScores[[#This Row],[Name]],RRGM3,3,0),\"\")","v":""},{"$f":"IFERROR(VLOOKUP(tScores[[#This Row],[Name]],RRGM4,3,0),\"\")","v":""},{"$f":"IFERROR(VLOOKUP(tScores[[#This Row],[Name]],RRGM5,3,0),\"\")","v":""},{"$f":"IFERROR(VLOOKUP(tScores[[#This Row],[Name]],RRGM6,3,0),\"\")","v":""},{"$f":"IFERROR(VLOOKUP(tScores[[#This Row],[Name]],RRGM7,3,0),\"\")","v":""},{"$f":"SUM(tScores[[#This Row],[B1]:[B7]])","v":0},{"$f":"IFERROR(tScores[[#This Row],[Total]]+tScores[[#This Row],[RR Total]]+tScores[[#This Row],[Btotal]],\"\")","v":801.02379999999994},{"$f":"IF(tScores[[#This Row],[Name]]=\"\",\"\",RANK(tScores[[#This Row],[SUBTotal]],tScores[SUBTotal])+(COUNTIF($AA$3:$AA21,tScores[[#This Row],[SUBTotal]]))-1)","v":23},{"$f":"IFERROR(VLOOKUP(tScores[[#This Row],[Name]],RRGM8,2,0),\"\")","v":""},{"$f":"IFERROR(VLOOKUP(tScores[[#This Row],[Name]],RRGM8,3,0),\"\")","v":""},{"$f":"IFERROR(tScores[[#This Row],[SUBTotal]]+SUM(tScores[[#This Row],[RR8]:[B8]]),\"\")","v":801.02379999999994},{"$f":"IF(tScores[[#This Row],[Name]]=\"\",\"\",RANK(tScores[[#This Row],[GT]],tScores[GT])+(COUNTIF($AE$3:$AE21,tScores[[#This Row],[GT]]))-1)","v":23}]
[12,"d",{"$f":"IF(tScores[[#This Row],[Name]]=\"\",\"\",tScores[[#This Row],[Lane]]&\"-\"&tScores[[#This Row],[Pos]])","v":"12-d"},"Bill Orlikowski",246,169,199,163,{"$f":"IFERROR(IF(tScores[[#This Row],[Name]]=\"\",\"\",SUM(tScores[[#This Row],[Game1]:[Game4]]))+MAX(tScores[[#This Row],[Game1]:[Game4]])/10000,\"\")","v":777.02459999999996},{"$f":"IF(tScores[[#This Row],[Name]]=\"\",\"\",RANK(tScores[[#This Row],[Total]],tScores[Total])+(COUNTIF($I$3:$I22,tScores[[#This Row],[Total]]))-1)","v":27},{"$f":"IFERROR(VLOOKUP(tScores[[#This Row],[Name]],RRGM1,2,0),\"\")","v":""},{"$f":"IFERROR(VLOOKUP(tScores[[#This Row],[Name]],RRGM2,2,0),\"\")","v":""},{"$f":"IFERROR(VLOOKUP(tScores[[#This Row],[Name]],RRGM3,2,0),\"\")","v":""},{"$f":"IFERROR(VLOOKUP(tScores[[#This Row],[Name]],RRGM4,2,0),\"\")","v":""},{"$f":"IFERROR(VLOOKUP(tScores[[#This Row],[Name]],RRGM5,2,0),\"\")","v":""},{"$f":"IFERROR(VLOOKUP(tScores[[#This Row],[Name]],RRGM6,2,0),\"\")","v":""},{"$f":"IFERROR(VLOOKUP(tScores[[#This Row],[Name]],RRGM7,2,0),\"\")","v":""},{"$f":"SUM(tScores[[#This Row],[RR1]:[RR7]])+MAX(tScores[[#This Row],[RANK1]:[RR7]])/10000","v":2.7000000000000001E-3},{"$f":"IFERROR(VLOOKUP(tScores[[#This Row],[Name]],RRGM1,3,0),\"\")","v":""},{"$f":"IFERROR(VLOOKUP(tScores[[#This Row],[Name]],RRGM2,3,0),\"\")","v":""},{"$f":"IFERROR(VLOOKUP(tScores[[#This Row],[Name]],RRGM3,3,0),\"\")","v":""},{"$f":"IFERROR(VLOOKUP(tScores[[#This Row],[Name]],RRGM4,3,0),\"\")","v":""},{"$f":"IFERROR(VLOOKUP(tScores[[#This Row],[Name]],RRGM5,3,0),\"\")","v":""},{"$f":"IFERROR(VLOOKUP(tScores[[#This Row],[Name]],RRGM6,3,0),\"\")","v":""},{"$f":"IFERROR(VLOOKUP(tScores[[#This Row],[Name]],RRGM7,3,0),\"\")","v":""},{"$f":"SUM(tScores[[#This Row],[B1]:[B7]])","v":0},{"$f":"IFERROR(tScores[[#This Row],[Total]]+tScores[[#This Row],[RR Total]]+tScores[[#This Row],[Btotal]],\"\")","v":777.02729999999997},{"$f":"IF(tScores[[#This Row],[Name]]=\"\",\"\",RANK(tScores[[#This Row],[SUBTotal]],tScores[SUBTotal])+(COUNTIF($AA$3:$AA22,tScores[[#This Row],[SUBTotal]]))-1)","v":27},{"$f":"IFERROR(VLOOKUP(tScores[[#This Row],[Name]],RRGM8,2,0),\"\")","v":""},{"$f":"IFERROR(VLOOKUP(tScores[[#This Row],[Name]],RRGM8,3,0),\"\")","v":""},{"$f":"IFERROR(tScores[[#This Row],[SUBTotal]]+SUM(tScores[[#This Row],[RR8]:[B8]]),\"\")","v":777.02729999999997},{"$f":"IF(tScores[[#This Row],[Name]]=\"\",\"\",RANK(tScores[[#This Row],[GT]],tScores[GT])+(COUNTIF($AE$3:$AE22,tScores[[#This Row],[GT]]))-1)","v":27}]
[12,"e",{"$f":"IF(tScores[[#This Row],[Name]]=\"\",\"\",tScores[[#This Row],[Lane]]&\"-\"&tScores[[#This Row],[Pos]])","v":"12-e"},"Ryan Ross",226,206,215,227,{"$f":"IFERROR(IF(tScores[[#This Row],[Name]]=\"\",\"\",SUM(tScores[[#This Row],[Game1]:[Game4]]))+MAX(tScores[[#This Row],[Game1]:[Game4]])/10000,\"\")","v":874.02269999999999},{"$f":"IF(tScores[[#This Row],[Name]]=\"\",\"\",RANK(tScores[[#This Row],[Total]],tScores[Total])+(COUNTIF($I$3:$I23,tScores[[#This Row],[Total]]))-1)","v":12},{"$f":"IFERROR(VLOOKUP(tScores[[#This Row],[Name]],RRGM1,2,0),\"\")","v":""},{"$f":"IFERROR(VLOOKUP(tScores[[#This Row],[Name]],RRGM2,2,0),\"\")","v":""},{"$f":"IFERROR(VLOOKUP(tScores[[#This Row],[Name]],RRGM3,2,0),\"\")","v":""},{"$f":"IFERROR(VLOOKUP(tScores[[#This Row],[Name]],RRGM4,2,0),\"\")","v":""},{"$f":"IFERROR(VLOOKUP(tScores[[#This Row],[Name]],RRGM5,2,0),\"\")","v":""},{"$f":"IFERROR(VLOOKUP(tScores[[#This Row],[Name]],RRGM6,2,0),\"\")","v":""},{"$f":"IFERROR(VLOOKUP(tScores[[#This Row],[Name]],RRGM7,2,0),\"\")","v":""},{"$f":"SUM(tScores[[#This Row],[RR1]:[RR7]])+MAX(tScores[[#This Row],[RANK1]:[RR7]])/10000","v":1.1999999999999999E-3},{"$f":"IFERROR(VLOOKUP(tScores[[#This Row],[Name]],RRGM1,3,0),\"\")","v":""},{"$f":"IFERROR(VLOOKUP(tScores[[#This Row],[Name]],RRGM2,3,0),\"\")","v":""},{"$f":"IFERROR(VLOOKUP(tScores[[#This Row],[Name]],RRGM3,3,0),\"\")","v":""},{"$f":"IFERROR(VLOOKUP(tScores[[#This Row],[Name]],RRGM4,3,0),\"\")","v":""},{"$f":"IFERROR(VLOOKUP(tScores[[#This Row],[Name]],RRGM5,3,0),\"\")","v":""},{"$f":"IFERROR(VLOOKUP(tScores[[#This Row],[Name]],RRGM6,3,0),\"\")","v":""},{"$f":"IFERROR(VLOOKUP(tScores[[#This Row],[Name]],RRGM7,3,0),\"\")","v":""},{"$f":"SUM(tScores[[#This Row],[B1]:[B7]])","v":0},{"$f":"IFERROR(tScores[[#This Row],[Total]]+tScores[[#This Row],[RR Total]]+tScores[[#This Row],[Btotal]],\"\")","v":874.02390000000003},{"$f":"IF(tScores[[#This Row],[Name]]=\"\",\"\",RANK(tScores[[#This Row],[SUBTotal]],tScores[SUBTotal])+(COUNTIF($AA$3:$AA23,tScores[[#This Row],[SUBTotal]]))-1)","v":12},{"$f":"IFERROR(VLOOKUP(tScores[[#This Row],[Name]],RRGM8,2,0),\"\")","v":""},{"$f":"IFERROR(VLOOKUP(tScores[[#This Row],[Name]],RRGM8,3,0),\"\")","v":""},{"$f":"IFERROR(tScores[[#This Row],[SUBTotal]]+SUM(tScores[[#This Row],[RR8]:[B8]]),\"\")","v":874.02390000000003},{"$f":"IF(tScores[[#This Row],[Name]]=\"\",\"\",RANK(tScores[[#This Row],[GT]],tScores[GT])+(COUNTIF($AE$3:$AE23,tScores[[#This Row],[GT]]))-1)","v":12}]
[13,"a",{"$f":"IF(tScores[[#This Row],[Name]]=\"\",\"\",tScores[[#This Row],[Lane]]&\"-\"&tScores[[#This Row],[Pos]])","v":"13-a"},"Mike Smith Jr",262,299,238,187,{"$f":"IFERROR(IF(tScores[[#This Row],[Name]]=\"\",\"\",SUM(tScores[[#This Row],[Game1]:[Game4]]))+MAX(tScores[[#This Row],[Game1]:[Game4]])/10000,\"\")","v":986.0299},{"$f":"IF(tScores[[#This Row],[Name]]=\"\",\"\",RANK(tScores[[#This Row],[Total]],tScores[Total])+(COUNTIF($I$3:$I24,tScores[[#This Row],[Total]]))-1)","v":2},{"$f":"IFERROR(VLOOKUP(tScores[[#This Row],[Name]],RRGM1,2,0),\"\")","v":203},{"$f":"IFERROR(VLOOKUP(tScores[[#This Row],[Name]],RRGM2,2,0),\"\")","v":223},{"$f":"IFERROR(VLOOKUP(tScores[[#This Row],[Name]],RRGM3,2,0),\"\")","v":182},{"$f":"IFERROR(VLOOKUP(tScores[[#This Row],[Name]],RRGM4,2,0),\"\")","v":194},{"$f":"IFERROR(VLOOKUP(tScores[[#This Row],[Name]],RRGM5,2,0),\"\")","v":206},{"$f":"IFERROR(VLOOKUP(tScores[[#This Row],[Name]],RRGM6,2,0),\"\")","v":228},{"$f":"IFERROR(VLOOKUP(tScores[[#This Row],[Name]],RRGM7,2,0),\"\")","v":233},{"$f":"SUM(tScores[[#This Row],[RR1]:[RR7]])+MAX(tScores[[#This Row],[RANK1]:[RR7]])/10000","v":1469.0233000000001},{"$f":"IFERROR(VLOOKUP(tScores[[#This Row],[Name]],RRGM1,3,0),\"\")","v":0},{"$f":"IFERROR(VLOOKUP(tScores[[#This Row],[Name]],RRGM2,3,0),\"\")","v":30},{"$f":"IFERROR(VLOOKUP(tScores[[#This Row],[Name]],RRGM3,3,0),\"\")","v":0},{"$f":"IFERROR(VLOOKUP(tScores[[#This Row],[Name]],RRGM4,3,0),\"\")","v":0},{"$f":"IFERROR(VLOOKUP(tScores[[#This Row],[Name]],RRGM5,3,0),\"\")","v":0},{"$f":"IFERROR(VLOOKUP(tScores[[#This Row],[Name]],RRGM6,3,0),\"\")","v":30},{"$f":"IFERROR(VLOOKUP(tScores[[#This Row],[Name]],RRGM7,3,0),\"\")","v":30},{"$f":"SUM(tScores[[#This Row],[B1]:[B7]])","v":90},{"$f":"IFERROR(tScores[[#This Row],[Total]]+tScores[[#This Row],[RR Total]]+tScores[[#This Row],[Btotal]],\"\")","v":2545.0532000000003},{"$f":"IF(tScores[[#This Row],[Name]]=\"\",\"\",RANK(tScores[[#This Row],[SUBTotal]],tScores[SUBTotal])+(COUNTIF($AA$3:$AA24,tScores[[#This Row],[SUBTotal]]))-1)","v":3},{"$f":"IFERROR(VLOOKUP(tScores[[#This Row],[Name]],RRGM8,2,0),\"\")","v":195},{"$f":"IFERROR(VLOOKUP(tScores[[#This Row],[Name]],RRGM8,3,0),\"\")","v":0},{"$f":"IFERROR(tScores[[#This Row],[SUBTotal]]+SUM(tScores[[#This Row],[RR8]:[B8]]),\"\")","v":2740.0532000000003},{"$f":"IF(tScores[[#This Row],[Name]]=\"\",\"\",RANK(tScores[[#This Row],[GT]],tScores[GT])+(COUNTIF($AE$3:$AE24,tScores[[#This Row],[GT]]))-1)","v":4}]
[13,"b",{"$f":"IF(tScores[[#This Row],[Name]]=\"\",\"\",tScores[[#This Row],[Lane]]&\"-\"&tScores[[#This Row],[Pos]])","v":"13-b"},"Mike Lipzinski",172,223,184,216,{"$f":"IFERROR(IF(tScores[[#This Row],[Name]]=\"\",\"\",SUM(tScores[[#This Row],[Game1]:[Game4]]))+MAX(tScores[[#This Row],[Game1]:[Game4]])/10000,\"\")","v":795.02229999999997},{"$f":"IF(tScores[[#This Row],[Name]]=\"\",\"\",RANK(tScores[[#This Row],[Total]],tScores[Total])+(COUNTIF($I$3:$I25,tScores[[#This Row],[Total]]))-1)","v":25},{"$f":"IFERROR(VLOOKUP(tScores[[#This Row],[Name]],RRGM1,2,0),\"\")","v":""},{"$f":"IFERROR(VLOOKUP(tScores[[#This Row],[Name]],RRGM2,2,0),\"\")","v":""},{"$f":"IFERROR(VLOOKUP(tScores[[#This Row],[Name]],RRGM3,2,0),\"\")","v":""},{"$f":"IFERROR(VLOOKUP(tScores[[#This Row],[Name]],RRGM4,2,0),\"\")","v":""},{"$f":"IFERROR(VLOOKUP(tScores[[#This Row],[Name]],RRGM5,2,0),\"\")","v":""},{"$f":"IFERROR(VLOOKUP(tScores[[#This Row],[Name]],RRGM6,2,0),\"\")","v":""},{"$f":"IFERROR(VLOOKUP(tScores[[#This Row],[Name]],RRGM7,2,0),\"\")","v":""},{"$f":"SUM(tScores[[#This Row],[RR1]:[RR7]])+MAX(tScores[[#This Row],[RANK1]:[RR7]])/10000","v":2.5000000000000001E-3},{"$f":"IFERROR(VLOOKUP(tScores[[#This Row],[Name]],RRGM1,3,0),\"\")","v":""},{"$f":"IFERROR(VLOOKUP(tScores[[#This Row],[Name]],RRGM2,3,0),\"\")","v":""},{"$f":"IFERROR(VLOOKUP(tScores[[#This Row],[Name]],RRGM3,3,0),\"\")","v":""},{"$f":"IFERROR(VLOOKUP(tScores[[#This Row],[Name]],RRGM4,3,0),\"\")","v":""},{"$f":"IFERROR(VLOOKUP(tScores[[#This Row],[Name]],RRGM5,3,0),\"\")","v":""},{"$f":"IFERROR(VLOOKUP(tScores[[#This Row],[Name]],RRGM6,3,0),\"\")","v":""},{"$f":"IFERROR(VLOOKUP(tScores[[#This Row],[Name]],RRGM7,3,0),\"\")","v":""},{"$f":"SUM(tScores[[#This Row],[B1]:[B7]])","v":0},{"$f":"IFERROR(tScores[[#This Row],[Total]]+tScores[[#This Row],[RR Total]]+tScores[[#This Row],[Btotal]],\"\")","v":795.02480000000003},{"$f":"IF(tScores[[#This Row],[Name]]=\"\",\"\",RANK(tScores[[#This Row],[SUBTotal]],tScores[SUBTotal])+(COUNTIF($AA$3:$AA25,tScores[[#This Row],[SUBTotal]]))-1)","v":25},{"$f":"IFERROR(VLOOKUP(tScores[[#This Row],[Name]],RRGM8,2,0),\"\")","v":""},{"$f":"IFERROR(VLOOKUP(tScores[[#This Row],[Name]],RRGM8,3,0),\"\")","v":""},{"$f":"IFERROR(tScores[[#This Row],[SUBTotal]]+SUM(tScores[[#This Row],[RR8]:[B8]]),\"\")","v":795.02480000000003},{"$f":"IF(tScores[[#This Row],[Name]]=\"\",\"\",RANK(tScores[[#This Row],[GT]],tScores[GT])+(COUNTIF($AE$3:$AE25,tScores[[#This Row],[GT]]))-1)","v":25}]
[14,"d",{"$f":"IF(tScores[[#This Row],[Name]]=\"\",\"\",tScores[[#This Row],[Lane]]&\"-\"&tScores[[#This Row],[Pos]])","v":"14-d"},"Don Nyenhuis Jr",246,257,187,179,{"$f":"IFERROR(IF(tScores[[#This Row],[Name]]=\"\",\"\",SUM(tScores[[#This Row],[Game1]:[Game4]]))+MAX(tScores[[#This Row],[Game1]:[Game4]])/10000,\"\")","v":869.02570000000003},{"$f":"IF(tScores[[#This Row],[Name]]=\"\",\"\",RANK(tScores[[#This Row],[Total]],tScores[Total])+(COUNTIF($I$3:$I26,tScores[[#This Row],[Total]]))-1)","v":15},{"$f":"IFERROR(VLOOKUP(tScores[[#This Row],[Name]],RRGM1,2,0),\"\")","v":""},{"$f":"IFERROR(VLOOKUP(tScores[[#This Row],[Name]],RRGM2,2,0),\"\")","v":""},{"$f":"IFERROR(VLOOKUP(tScores[[#This Row],[Name]],RRGM3,2,0),\"\")","v":""},{"$f":"IFERROR(VLOOKUP(tScores[[#This Row],[Name]],RRGM4,2,0),\"\")","v":""},{"$f":"IFERROR(VLOOKUP(tScores[[#This Row],[Name]],RRGM5,2,0),\"\")","v":""},{"$f":"IFERROR(VLOOKUP(tScores[[#This Row],[Name]],RRGM6,2,0),\"\")","v":""},{"$f":"IFERROR(VLOOKUP(tScores[[#This Row],[Name]],RRGM7,2,0),\"\")","v":""},{"$f":"SUM(tScores[[#This Row],[RR1]:[RR7]])+MAX(tScores[[#This Row],[RANK1]:[RR7]])/10000","v":1.5E-3},{"$f":"IFERROR(VLOOKUP(tScores[[#This Row],[Name]],RRGM1,3,0),\"\")","v":""},{"$f":"IFERROR(VLOOKUP(tScores[[#This Row],[Name]],RRGM2,3,0),\"\")","v":""},{"$f":"IFERROR(VLOOKUP(tScores[[#This Row],[Name]],RRGM3,3,0),\"\")","v":""},{"$f":"IFERROR(VLOOKUP(tScores[[#This Row],[Name]],RRGM4,3,0),\"\")","v":""},{"$f":"IFERROR(VLOOKUP(tScores[[#This Row],[Name]],RRGM5,3,0),\"\")","v":""},{"$f":"IFERROR(VLOOKUP(tScores[[#This Row],[Name]],RRGM6,3,0),\"\")","v":""},{"$f":"IFERROR(VLOOKUP(tScores[[#This Row],[Name]],RRGM7,3,0),\"\")","v":""},{"$f":"SUM(tScores[[#This Row],[B1]:[B7]])","v":0},{"$f":"IFERROR(tScores[[#This Row],[Total]]+tScores[[#This Row],[RR Total]]+tScores[[#This Row],[Btotal]],\"\")","v":869.02719999999999},{"$f":"IF(tScores[[#This Row],[Name]]=\"\",\"\",RANK(tScores[[#This Row],[SUBTotal]],tScores[SUBTotal])+(COUNTIF($AA$3:$AA26,tScores[[#This Row],[SUBTotal]]))-1)","v":15},{"$f":"IFERROR(VLOOKUP(tScores[[#This Row],[Name]],RRGM8,2,0),\"\")","v":""},{"$f":"IFERROR(VLOOKUP(tScores[[#This Row],[Name]],RRGM8,3,0),\"\")","v":""},{"$f":"IFERROR(tScores[[#This Row],[SUBTotal]]+SUM(tScores[[#This Row],[RR8]:[B8]]),\"\")","v":869.02719999999999},{"$f":"IF(tScores[[#This Row],[Name]]=\"\",\"\",RANK(tScores[[#This Row],[GT]],tScores[GT])+(COUNTIF($AE$3:$AE26,tScores[[#This Row],[GT]]))-1)","v":15}]
[14,"e",{"$f":"IF(tScores[[#This Row],[Name]]=\"\",\"\",tScores[[#This Row],[Lane]]&\"-\"&tScores[[#This Row],[Pos]])","v":"14-e"},"Ben Rabourn",236,224,223,238,{"$f":"IFERROR(IF(tScores[[#This Row],[Name]]=\"\",\"\",SUM(tScores[[#This Row],[Game1]:[Game4]]))+MAX(tScores[[#This Row],[Game1]:[Game4]])/10000,\"\")","v":921.02380000000005},{"$f":"IF(tScores[[#This Row],[Name]]=\"\",\"\",RANK(tScores[[#This Row],[Total]],tScores[Total])+(COUNTIF($I$3:$I27,tScores[[#This Row],[Total]]))-1)","v":7},{"$f":"IFERROR(VLOOKUP(tScores[[#This Row],[Name]],RRGM1,2,0),\"\")","v":247},{"$f":"IFERROR(VLOOKUP(tScores[[#This Row],[Name]],RRGM2,2,0),\"\")","v":268},{"$f":"IFERROR(VLOOKUP(tScores[[#This Row],[Name]],RRGM3,2,0),\"\")","v":258},{"$f":"IFERROR(VLOOKUP(tScores[[#This Row],[Name]],RRGM4,2,0),\"\")","v":224},{"$f":"IFERROR(VLOOKUP(tScores[[#This Row],[Name]],RRGM5,2,0),\"\")","v":246},{"$f":"IFERROR(VLOOKUP(tScores[[#This Row],[Name]],RRGM6,2,0),\"\")","v":258},{"$f":"IFERROR(VLOOKUP(tScores[[#This Row],[Name]],RRGM7,2,0),\"\")","v":267},{"$f":"SUM(tScores[[#This Row],[RR1]:[RR7]])+MAX(tScores[[#This Row],[RANK1]:[RR7]])/10000","v":1768.0268000000001},{"$f":"IFERROR(VLOOKUP(tScores[[#This Row],[Name]],RRGM1,3,0),\"\")","v":30},{"$f":"IFERROR(VLOOKUP(tScores[[#This Row],[Name]],RRGM2,3,0),\"\")","v":30},{"$f":"IFERROR(VLOOKUP(tScores[[#This Row],[Name]],RRGM3,3,0),\"\")","v":30},{"$f":"IFERROR(VLOOKUP(tScores[[#This Row],[Name]],RRGM4,3,0),\"\")","v":30},{"$f":"IFERROR(VLOOKUP(tScores[[#This Row],[Name]],RRGM5,3,0),\"\")","v":30},{"$f":"IFERROR(VLOOKUP(tScores[[#This Row],[Name]],RRGM6,3,0),\"\")","v":30},{"$f":"IFERROR(VLOOKUP(tScores[[#This Row],[Name]],RRGM7,3,0),\"\")","v":30},{"$f":"SUM(tScores[[#This Row],[B1]:[B7]])","v":210},{"$f":"IFERROR(tScores[[#This Row],[Total]]+tScores[[#This Row],[RR Total]]+tScores[[#This Row],[Btotal]],\"\")","v":2899.0506},{"$f":"IF(tScores[[#This Row],[Name]]=\"\",\"\",RANK(tScores[[#This Row],[SUBTotal]],tScores[SUBTotal])+(COUNTIF($AA$3:$AA27,tScores[[#This Row],[SUBTotal]]))-1)","v":1},{"$f":"IFERROR(VLOOKUP(tScores[[#This Row],[Name]],RRGM8,2,0),\"\")","v":204},{"$f":"IFERROR(VLOOKUP(tScores[[#This Row],[Name]],RRGM8,3,0),\"\")","v":0},{"$f":"IFERROR(tScores[[#This Row],[SUBTotal]]+SUM(tScores[[#This Row],[RR8]:[B8]]),\"\")","v":3103.0506},{"$f":"IF(tScores[[#This Row],[Name]]=\"\",\"\",RANK(tScores[[#This Row],[GT]],tScores[GT])+(COUNTIF($AE$3:$AE27,tScores[[#This Row],[GT]]))-1)","v":1}]
[15,"a",{"$f":"IF(tScores[[#This Row],[Name]]=\"\",\"\",tScores[[#This Row],[Lane]]&\"-\"&tScores[[#This Row],[Pos]])","v":"15-a"},"Matt Jelsma",224,215,192,191,{"$f":"IFERROR(IF(tScores[[#This Row],[Name]]=\"\",\"\",SUM(tScores[[#This Row],[Game1]:[Game4]]))+MAX(tScores[[#This Row],[Game1]:[Game4]])/10000,\"\")","v":822.02239999999995},{"$f":"IF(tScores[[#This Row],[Name]]=\"\",\"\",RANK(tScores[[#This Row],[Total]],tScores[Total])+(COUNTIF($I$3:$I28,tScores[[#This Row],[Total]]))-1)","v":21},{"$f":"IFERROR(VLOOKUP(tScores[[#This Row],[Name]],RRGM1,2,0),\"\")","v":""},{"$f":"IFERROR(VLOOKUP(tScores[[#This Row],[Name]],RRGM2,2,0),\"\")","v":""},{"$f":"IFERROR(VLOOKUP(tScores[[#This Row],[Name]],RRGM3,2,0),\"\")","v":""},{"$f":"IFERROR(VLOOKUP(tScores[[#This Row],[Name]],RRGM4,2,0),\"\")","v":""},{"$f":"IFERROR(VLOOKUP(tScores[[#This Row],[Name]],RRGM5,2,0),\"\")","v":""},{"$f":"IFERROR(VLOOKUP(tScores[[#This Row],[Name]],RRGM6,2,0),\"\")","v":""},{"$f":"IFERROR(VLOOKUP(tScores[[#This Row],[Name]],RRGM7,2,0),\"\")","v":""},{"$f":"SUM(tScores[[#This Row],[RR1]:[RR7]])+MAX(tScores[[#This Row],[RANK1]:[RR7]])/10000","v":2.0999999999999999E-3},{"$f":"IFERROR(VLOOKUP(tScores[[#This Row],[Name]],RRGM1,3,0),\"\")","v":""},{"$f":"IFERROR(VLOOKUP(tScores[[#This Row],[Name]],RRGM2,3,0),\"\")","v":""},{"$f":"IFERROR(VLOOKUP(tScores[[#This Row],[Name]],RRGM3,3,0),\"\")","v":""},{"$f":"IFERROR(VLOOKUP(tScores[[#This Row],[Name]],RRGM4,3,0),\"\")","v":""},{"$f":"IFERROR(VLOOKUP(tScores[[#This Row],[Name]],RRGM5,3,0),\"\")","v":""},{"$f":"IFERROR(VLOOKUP(tScores[[#This Row],[Name]],RRGM6,3,0),\"\")","v":""},{"$f":"IFERROR(VLOOKUP(tScores[[#This Row],[Name]],RRGM7,3,0),\"\")","v":""},{"$f":"SUM(tScores[[#This Row],[B1]:[B7]])","v":0},{"$f":"IFERROR(tScores[[#This Row],[Total]]+tScores[[#This Row],[RR Total]]+tScores[[#This Row],[Btotal]],\"\")","v":822.02449999999999},{"$f":"IF(tScores[[#This Row],[Name]]=\"\",\"\",RANK(tScores[[#This Row],[SUBTotal]],tScores[SUBTotal])+(COUNTIF($AA$3:$AA28,tScores[[#This Row],[SUBTotal]]))-1)","v":21},{"$f":"IFERROR(VLOOKUP(tScores[[#This Row],[Name]],RRGM8,2,0),\"\")","v":""},{"$f":"IFERROR(VLOOKUP(tScores[[#This Row],[Name]],RRGM8,3,0),\"\")","v":""},{"$f":"IFERROR(tScores[[#This Row],[SUBTotal]]+SUM(tScores[[#This Row],[RR8]:[B8]]),\"\")","v":822.02449999999999},{"$f":"IF(tScores[[#This Row],[Name]]=\"\",\"\",RANK(tScores[[#This Row],[GT]],tScores[GT])+(COUNTIF($AE$3:$AE28,tScores[[#This Row],[GT]]))-1)","v":21}]
[15,"b",{"$f":"IF(tScores[[#This Row],[Name]]=\"\",\"\",tScores[[#This Row],[Lane]]&\"-\"&tScores[[#This Row],[Pos]])","v":"15-b"},"Chris Slagter",227,259,237,213,{"$f":"IFERROR(IF(tScores[[#This Row],[Name]]=\"\",\"\",SUM(tScores[[#This Row],[Game1]:[Game4]]))+MAX(tScores[[#This Row],[Game1]:[Game4]])/10000,\"\")","v":936.02589999999998},{"$f":"IF(tScores[[#This Row],[Name]]=\"\",\"\",RANK(tScores[[#This Row],[Total]],tScores[Total])+(COUNTIF($I$3:$I29,tScores[[#This Row],[Total]]))-1)","v":5},{"$f":"IFERROR(VLOOKUP(tScores[[#This Row],[Name]],RRGM1,2,0),\"\")","v":220},{"$f":"IFERROR(VLOOKUP(tScores[[#This Row],[Name]],RRGM2,2,0),\"\")","v":229},{"$f":"IFERROR(VLOOKUP(tScores[[#This Row],[Name]],RRGM3,2,0),\"\")","v":189},{"$f":"IFERROR(VLOOKUP(tScores[[#This Row],[Name]],RRGM4,2,0),\"\")","v":197},{"$f":"IFERROR(VLOOKUP(tScores[[#This Row],[Name]],RRGM5,2,0),\"\")","v":216},{"$f":"IFERROR(VLOOKUP(tScores[[#This Row],[Name]],RRGM6,2,0),\"\")","v":176},{"$f":"IFERROR(VLOOKUP(tScores[[#This Row],[Name]],RRGM7,2,0),\"\")","v":259},{"$f":"SUM(tScores[[#This Row],[RR1]:[RR7]])+MAX(tScores[[#This Row],[RANK1]:[RR7]])/10000","v":1486.0259000000001},{"$f":"IFERROR(VLOOKUP(tScores[[#This Row],[Name]],RRGM1,3,0),\"\")","v":0},{"$f":"IFERROR(VLOOKUP(tScores[[#This Row],[Name]],RRGM2,3,0),\"\")","v":0},{"$f":"IFERROR(VLOOKUP(tScores[[#This Row],[Name]],RRGM3,3,0),\"\")","v":0},{"$f":"IFERROR(VLOOKUP(tScores[[#This Row],[Name]],RRGM4,3,0),\"\")","v":0},{"$f":"IFERROR(VLOOKUP(tScores[[#This Row],[Name]],RRGM5,3,0),\"\")","v":30},{"$f":"IFERROR(VLOOKUP(tScores[[#This Row],[Name]],RRGM6,3,0),\"\")","v":0},{"$f":"IFERROR(VLOOKUP(tScores[[#This Row],[Name]],RRGM7,3,0),\"\")","v":30},{"$f":"SUM(tScores[[#This Row],[B1]:[B7]])","v":60},{"$f":"IFERROR(tScores[[#This Row],[Total]]+tScores[[#This Row],[RR Total]]+tScores[[#This Row],[Btotal]],\"\")","v":2482.0518000000002},{"$f":"IF(tScores[[#This Row],[Name]]=\"\",\"\",RANK(tScores[[#This Row],[SUBTotal]],tScores[SUBTotal])+(COUNTIF($AA$3:$AA29,tScores[[#This Row],[SUBTotal]]))-1)","v":6},{"$f":"IFERROR(VLOOKUP(tScores[[#This Row],[Name]],RRGM8,2,0),\"\")","v":209},{"$f":"IFERROR(VLOOKUP(tScores[[#This Row],[Name]],RRGM8,3,0),\"\")","v":30},{"$f":"IFERROR(tScores[[#This Row],[SUBTotal]]+SUM(tScores[[#This Row],[RR8]:[B8]]),\"\")","v":2721.0518000000002},{"$f":"IF(tScores[[#This Row],[Name]]=\"\",\"\",RANK(tScores[[#This Row],[GT]],tScores[GT])+(COUNTIF($AE$3:$AE29,tScores[[#This Row],[GT]]))-1)","v":5}]
[16,"d",{"$f":"IF(tScores[[#This Row],[Name]]=\"\",\"\",tScores[[#This Row],[Lane]]&\"-\"&tScores[[#This Row],[Pos]])","v":"16-d"},"Chad Reiffer",269,217,189,192,{"$f":"IFERROR(IF(tScores[[#This Row],[Name]]=\"\",\"\",SUM(tScores[[#This Row],[Game1]:[Game4]]))+MAX(tScores[[#This Row],[Game1]:[Game4]])/10000,\"\")","v":867.02689999999996},{"$f":"IF(tScores[[#This Row],[Name]]=\"\",\"\",RANK(tScores[[#This Row],[Total]],tScores[Total])+(COUNTIF($I$3:$I30,tScores[[#This Row],[Total]]))-1)","v":16},{"$f":"IFERROR(VLOOKUP(tScores[[#This Row],[Name]],RRGM1,2,0),\"\")","v":""},{"$f":"IFERROR(VLOOKUP(tScores[[#This Row],[Name]],RRGM2,2,0),\"\")","v":""},{"$f":"IFERROR(VLOOKUP(tScores[[#This Row],[Name]],RRGM3,2,0),\"\")","v":""},{"$f":"IFERROR(VLOOKUP(tScores[[#This Row],[Name]],RRGM4,2,0),\"\")","v":""},{"$f":"IFERROR(VLOOKUP(tScores[[#This Row],[Name]],RRGM5,2,0),\"\")","v":""},{"$f":"IFERROR(VLOOKUP(tScores[[#This Row],[Name]],RRGM6,2,0),\"\")","v":""},{"$f":"IFERROR(VLOOKUP(tScores[[#This Row],[Name]],RRGM7,2,0),\"\")","v":""},{"$f":"SUM(tScores[[#This Row],[RR1]:[RR7]])+MAX(tScores[[#This Row],[RANK1]:[RR7]])/10000","v":1.6000000000000001E-3},{"$f":"IFERROR(VLOOKUP(tScores[[#This Row],[Name]],RRGM1,3,0),\"\")","v":""},{"$f":"IFERROR(VLOOKUP(tScores[[#This Row],[Name]],RRGM2,3,0),\"\")","v":""},{"$f":"IFERROR(VLOOKUP(tScores[[#This Row],[Name]],RRGM3,3,0),\"\")","v":""},{"$f":"IFERROR(VLOOKUP(tScores[[#This Row],[Name]],RRGM4,3,0),\"\")","v":""},{"$f":"IFERROR(VLOOKUP(tScores[[#This Row],[Name]],RRGM5,3,0),\"\")","v":""},{"$f":"IFERROR(VLOOKUP(tScores[[#This Row],[Name]],RRGM6,3,0),\"\")","v":""},{"$f":"IFERROR(VLOOKUP(tScores[[#This Row],[Name]],RRGM7,3,0),\"\")","v":""},{"$f":"SUM(tScores[[#This Row],[B1]:[B7]])","v":0},{"$f":"IFERROR(tScores[[#This Row],[Total]]+tScores[[#This Row],[RR Total]]+tScores[[#This Row],[Btotal]],\"\")","v":867.02850000000001},{"$f":"IF(tScores[[#This Row],[Name]]=\"\",\"\",RANK(tScores[[#This Row],[SUBTotal]],tScores[SUBTotal])+(COUNTIF($AA$3:$AA30,tScores[[#This Row],[SUBTotal]]))-1)","v":16},{"$f":"IFERROR(VLOOKUP(tScores[[#This Row],[Name]],RRGM8,2,0),\"\")","v":""},{"$f":"IFERROR(VLOOKUP(tScores[[#This Row],[Name]],RRGM8,3,0),\"\")","v":""},{"$f":"IFERROR(tScores[[#This Row],[SUBTotal]]+SUM(tScores[[#This Row],[RR8]:[B8]]),\"\")","v":867.02850000000001},{"$f":"IF(tScores[[#This Row],[Name]]=\"\",\"\",RANK(tScores[[#This Row],[GT]],tScores[GT])+(COUNTIF($AE$3:$AE30,tScores[[#This Row],[GT]]))-1)","v":16}]
[16,"e",{"$f":"IF(tScores[[#This Row],[Name]]=\"\",\"\",tScores[[#This Row],[Lane]]&\"-\"&tScores[[#This Row],[Pos]])","v":"16-e"},"Jeremy Pettenger",244,191,203,233,{"$f":"IFERROR(IF(tScores[[#This Row],[Name]]=\"\",\"\",SUM(tScores[[#This Row],[Game1]:[Game4]]))+MAX(tScores[[#This Row],[Game1]:[Game4]])/10000,\"\")","v":871.02440000000001},{"$f":"IF(tScores[[#This Row],[Name]]=\"\",\"\",RANK(tScores[[#This Row],[Total]],tScores[Total])+(COUNTIF($I$3:$I31,tScores[[#This Row],[Total]]))-1)","v":14},{"$f":"IFERROR(VLOOKUP(tScores[[#This Row],[Name]],RRGM1,2,0),\"\")","v":""},{"$f":"IFERROR(VLOOKUP(tScores[[#This Row],[Name]],RRGM2,2,0),\"\")","v":""},{"$f":"IFERROR(VLOOKUP(tScores[[#This Row],[Name]],RRGM3,2,0),\"\")","v":""},{"$f":"IFERROR(VLOOKUP(tScores[[#This Row],[Name]],RRGM4,2,0),\"\")","v":""},{"$f":"IFERROR(VLOOKUP(tScores[[#This Row],[Name]],RRGM5,2,0),\"\")","v":""},{"$f":"IFERROR(VLOOKUP(tScores[[#This Row],[Name]],RRGM6,2,0),\"\")","v":""},{"$f":"IFERROR(VLOOKUP(tScores[[#This Row],[Name]],RRGM7,2,0),\"\")","v":""},{"$f":"SUM(tScores[[#This Row],[RR1]:[RR7]])+MAX(tScores[[#This Row],[RANK1]:[RR7]])/10000","v":1.4E-3},{"$f":"IFERROR(VLOOKUP(tScores[[#This Row],[Name]],RRGM1,3,0),\"\")","v":""},{"$f":"IFERROR(VLOOKUP(tScores[[#This Row],[Name]],RRGM2,3,0),\"\")","v":""},{"$f":"IFERROR(VLOOKUP(tScores[[#This Row],[Name]],RRGM3,3,0),\"\")","v":""},{"$f":"IFERROR(VLOOKUP(tScores[[#This Row],[Name]],RRGM4,3,0),\"\")","v":""},{"$f":"IFERROR(VLOOKUP(tScores[[#This Row],[Name]],RRGM5,3,0),\"\")","v":""},{"$f":"IFERROR(VLOOKUP(tScores[[#This Row],[Name]],RRGM6,3,0),\"\")","v":""},{"$f":"IFERROR(VLOOKUP(tScores[[#This Row],[Name]],RRGM7,3,0),\"\")","v":""},{"$f":"SUM(tScores[[#This Row],[B1]:[B7]])","v":0},{"$f":"IFERROR(tScores[[#This Row],[Total]]+tScores[[#This Row],[RR Total]]+tScores[[#This Row],[Btotal]],\"\")","v":871.0258},{"$f":"IF(tScores[[#This Row],[Name]]=\"\",\"\",RANK(tScores[[#This Row],[SUBTotal]],tScores[SUBTotal])+(COUNTIF($AA$3:$AA31,tScores[[#This Row],[SUBTotal]]))-1)","v":14},{"$f":"IFERROR(VLOOKUP(tScores[[#This Row],[Name]],RRGM8,2,0),\"\")","v":""},{"$f":"IFERROR(VLOOKUP(tScores[[#This Row],[Name]],RRGM8,3,0),\"\")","v":""},{"$f":"IFERROR(tScores[[#This Row],[SUBTotal]]+SUM(tScores[[#This Row],[RR8]:[B8]]),\"\")","v":871.0258},{"$f":"IF(tScores[[#This Row],[Name]]=\"\",\"\",RANK(tScores[[#This Row],[GT]],tScores[GT])+(COUNTIF($AE$3:$AE31,tScores[[#This Row],[GT]]))-1)","v":14}]
[17,"a",{"$f":"IF(tScores[[#This Row],[Name]]=\"\",\"\",tScores[[#This Row],[Lane]]&\"-\"&tScores[[#This Row],[Pos]])","v":"17-a"},"John Powney",196,153,140,203,{"$f":"IFERROR(IF(tScores[[#This Row],[Name]]=\"\",\"\",SUM(tScores[[#This Row],[Game1]:[Game4]]))+MAX(tScores[[#This Row],[Game1]:[Game4]])/10000,\"\")","v":692.02030000000002},{"$f":"IF(tScores[[#This Row],[Name]]=\"\",\"\",RANK(tScores[[#This Row],[Total]],tScores[Total])+(COUNTIF($I$3:$I32,tScores[[#This Row],[Total]]))-1)","v":33},{"$f":"IFERROR(VLOOKUP(tScores[[#This Row],[Name]],RRGM1,2,0),\"\")","v":""},{"$f":"IFERROR(VLOOKUP(tScores[[#This Row],[Name]],RRGM2,2,0),\"\")","v":""},{"$f":"IFERROR(VLOOKUP(tScores[[#This Row],[Name]],RRGM3,2,0),\"\")","v":""},{"$f":"IFERROR(VLOOKUP(tScores[[#This Row],[Name]],RRGM4,2,0),\"\")","v":""},{"$f":"IFERROR(VLOOKUP(tScores[[#This Row],[Name]],RRGM5,2,0),\"\")","v":""},{"$f":"IFERROR(VLOOKUP(tScores[[#This Row],[Name]],RRGM6,2,0),\"\")","v":""},{"$f":"IFERROR(VLOOKUP(tScores[[#This Row],[Name]],RRGM7,2,0),\"\")","v":""},{"$f":"SUM(tScores[[#This Row],[RR1]:[RR7]])+MAX(tScores[[#This Row],[RANK1]:[RR7]])/10000","v":3.3E-3},{"$f":"IFERROR(VLOOKUP(tScores[[#This Row],[Name]],RRGM1,3,0),\"\")","v":""},{"$f":"IFERROR(VLOOKUP(tScores[[#This Row],[Name]],RRGM2,3,0),\"\")","v":""},{"$f":"IFERROR(VLOOKUP(tScores[[#This Row],[Name]],RRGM3,3,0),\"\")","v":""},{"$f":"IFERROR(VLOOKUP(tScores[[#This Row],[Name]],RRGM4,3,0),\"\")","v":""},{"$f":"IFERROR(VLOOKUP(tScores[[#This Row],[Name]],RRGM5,3,0),\"\")","v":""},{"$f":"IFERROR(VLOOKUP(tScores[[#This Row],[Name]],RRGM6,3,0),\"\")","v":""},{"$f":"IFERROR(VLOOKUP(tScores[[#This Row],[Name]],RRGM7,3,0),\"\")","v":""},{"$f":"SUM(tScores[[#This Row],[B1]:[B7]])","v":0},{"$f":"IFERROR(tScores[[#This Row],[Total]]+tScores[[#This Row],[RR Total]]+tScores[[#This Row],[Btotal]],\"\")","v":692.02359999999999},{"$f":"IF(tScores[[#This Row],[Name]]=\"\",\"\",RANK(tScores[[#This Row],[SUBTotal]],tScores[SUBTotal])+(COUNTIF($AA$3:$AA32,tScores[[#This Row],[SUBTotal]]))-1)","v":33},{"$f":"IFERROR(VLOOKUP(tScores[[#This Row],[Name]],RRGM8,2,0),\"\")","v":""},{"$f":"IFERROR(VLOOKUP(tScores[[#This Row],[Name]],RRGM8,3,0),\"\")","v":""},{"$f":"IFERROR(tScores[[#This Row],[SUBTotal]]+SUM(tScores[[#This Row],[RR8]:[B8]]),\"\")","v":692.02359999999999},{"$f":"IF(tScores[[#This Row],[Name]]=\"\",\"\",RANK(tScores[[#This Row],[GT]],tScores[GT])+(COUNTIF($AE$3:$AE32,tScores[[#This Row],[GT]]))-1)","v":33}]
[17,"b",{"$f":"IF(tScores[[#This Row],[Name]]=\"\",\"\",tScores[[#This Row],[Lane]]&\"-\"&tScores[[#This Row],[Pos]])","v":"17-b"},"Brad Nawrocki",185,200,158,236,{"$f":"IFERROR(IF(tScores[[#This Row],[Name]]=\"\",\"\",SUM(tScores[[#This Row],[Game1]:[Game4]]))+MAX(tScores[[#This Row],[Game1]:[Game4]])/10000,\"\")","v":779.02359999999999},{"$f":"IF(tScores[[#This Row],[Name]]=\"\",\"\",RANK(tScores[[#This Row],[Total]],tScores[Total])+(COUNTIF($I$3:$I33,tScores[[#This Row],[Total]]))-1)","v":26},{"$f":"IFERROR(VLOOKUP(tScores[[#This Row],[Name]],RRGM1,2,0),\"\")","v":""},{"$f":"IFERROR(VLOOKUP(tScores[[#This Row],[Name]],RRGM2,2,0),\"\")","v":""},{"$f":"IFERROR(VLOOKUP(tScores[[#This Row],[Name]],RRGM3,2,0),\"\")","v":""},{"$f":"IFERROR(VLOOKUP(tScores[[#This Row],[Name]],RRGM4,2,0),\"\")","v":""},{"$f":"IFERROR(VLOOKUP(tScores[[#This Row],[Name]],RRGM5,2,0),\"\")","v":""},{"$f":"IFERROR(VLOOKUP(tScores[[#This Row],[Name]],RRGM6,2,0),\"\")","v":""},{"$f":"IFERROR(VLOOKUP(tScores[[#This Row],[Name]],RRGM7,2,0),\"\")","v":""},{"$f":"SUM(tScores[[#This Row],[RR1]:[RR7]])+MAX(tScores[[#This Row],[RANK1]:[RR7]])/10000","v":2.5999999999999999E-3},{"$f":"IFERROR(VLOOKUP(tScores[[#This Row],[Name]],RRGM1,3,0),\"\")","v":""},{"$f":"IFERROR(VLOOKUP(tScores[[#This Row],[Name]],RRGM2,3,0),\"\")","v":""},{"$f":"IFERROR(VLOOKUP(tScores[[#This Row],[Name]],RRGM3,3,0),\"\")","v":""},{"$f":"IFERROR(VLOOKUP(tScores[[#This Row],[Name]],RRGM4,3,0),\"\")","v":""},{"$f":"IFERROR(VLOOKUP(tScores[[#This Row],[Name]],RRGM5,3,0),\"\")","v":""},{"$f":"IFERROR(VLOOKUP(tScores[[#This Row],[Name]],RRGM6,3,0),\"\")","v":""},{"$f":"IFERROR(VLOOKUP(tScores[[#This Row],[Name]],RRGM7,3,0),\"\")","v":""},{"$f":"SUM(tScores[[#This Row],[B1]:[B7]])","v":0},{"$f":"IFERROR(tScores[[#This Row],[Total]]+tScores[[#This Row],[RR Total]]+tScores[[#This Row],[Btotal]],\"\")","v":779.02620000000002},{"$f":"IF(tScores[[#This Row],[Name]]=\"\",\"\",RANK(tScores[[#This Row],[SUBTotal]],tScores[SUBTotal])+(COUNTIF($AA$3:$AA33,tScores[[#This Row],[SUBTotal]]))-1)","v":26},{"$f":"IFERROR(VLOOKUP(tScores[[#This Row],[Name]],RRGM8,2,0),\"\")","v":""},{"$f":"IFERROR(VLOOKUP(tScores[[#This Row],[Name]],RRGM8,3,0),\"\")","v":""},{"$f":"IFERROR(tScores[[#This Row],[SUBTotal]]+SUM(tScores[[#This Row],[RR8]:[B8]]),\"\")","v":779.02620000000002},{"$f":"IF(tScores[[#This Row],[Name]]=\"\",\"\",RANK(tScores[[#This Row],[GT]],tScores[GT])+(COUNTIF($AE$3:$AE33,tScores[[#This Row],[GT]]))-1)","v":26}]
[18,"d",{"$f":"IF(tScores[[#This Row],[Name]]=\"\",\"\",tScores[[#This Row],[Lane]]&\"-\"&tScores[[#This Row],[Pos]])","v":"18-d"},"George Miller",234,200,300,257,{"$f":"IFERROR(IF(tScores[[#This Row],[Name]]=\"\",\"\",SUM(tScores[[#This Row],[Game1]:[Game4]]))+MAX(tScores[[#This Row],[Game1]:[Game4]])/10000,\"\")","v":991.03},{"$f":"IF(tScores[[#This Row],[Name]]=\"\",\"\",RANK(tScores[[#This Row],[Total]],tScores[Total])+(COUNTIF($I$3:$I34,tScores[[#This Row],[Total]]))-1)","v":1},{"$f":"IFERROR(VLOOKUP(tScores[[#This Row],[Name]],RRGM1,2,0),\"\")","v":236},{"$f":"IFERROR(VLOOKUP(tScores[[#This Row],[Name]],RRGM2,2,0),\"\")","v":204},{"$f":"IFERROR(VLOOKUP(tScores[[#This Row],[Name]],RRGM3,2,0),\"\")","v":161},{"$f":"IFERROR(VLOOKUP(tScores[[#This Row],[Name]],RRGM4,2,0),\"\")","v":209},{"$f":"IFERROR(VLOOKUP(tScores[[#This Row],[Name]],RRGM5,2,0),\"\")","v":179},{"$f":"IFERROR(VLOOKUP(tScores[[#This Row],[Name]],RRGM6,2,0),\"\")","v":229},{"$f":"IFERROR(VLOOKUP(tScores[[#This Row],[Name]],RRGM7,2,0),\"\")","v":184},{"$f":"SUM(tScores[[#This Row],[RR1]:[RR7]])+MAX(tScores[[#This Row],[RANK1]:[RR7]])/10000","v":1402.0236},{"$f":"IFERROR(VLOOKUP(tScores[[#This Row],[Name]],RRGM1,3,0),\"\")","v":30},{"$f":"IFERROR(VLOOKUP(tScores[[#This Row],[Name]],RRGM2,3,0),\"\")","v":30},{"$f":"IFERROR(VLOOKUP(tScores[[#This Row],[Name]],RRGM3,3,0),\"\")","v":0},{"$f":"IFERROR(VLOOKUP(tScores[[#This Row],[Name]],RRGM4,3,0),\"\")","v":30},{"$f":"IFERROR(VLOOKUP(tScores[[#This Row],[Name]],RRGM5,3,0),\"\")","v":0},{"$f":"IFERROR(VLOOKUP(tScores[[#This Row],[Name]],RRGM6,3,0),\"\")","v":30},{"$f":"IFERROR(VLOOKUP(tScores[[#This Row],[Name]],RRGM7,3,0),\"\")","v":0},{"$f":"SUM(tScores[[#This Row],[B1]:[B7]])","v":120},{"$f":"IFERROR(tScores[[#This Row],[Total]]+tScores[[#This Row],[RR Total]]+tScores[[#This Row],[Btotal]],\"\")","v":2513.0536000000002},{"$f":"IF(tScores[[#This Row],[Name]]=\"\",\"\",RANK(tScores[[#This Row],[SUBTotal]],tScores[SUBTotal])+(COUNTIF($AA$3:$AA34,tScores[[#This Row],[SUBTotal]]))-1)","v":4},{"$f":"IFERROR(VLOOKUP(tScores[[#This Row],[Name]],RRGM8,2,0),\"\")","v":230},{"$f":"IFERROR(VLOOKUP(tScores[[#This Row],[Name]],RRGM8,3,0),\"\")","v":30},{"$f":"IFERROR(tScores[[#This Row],[SUBTotal]]+SUM(tScores[[#This Row],[RR8]:[B8]]),\"\")","v":2773.0536000000002},{"$f":"IF(tScores[[#This Row],[Name]]=\"\",\"\",RANK(tScores[[#This Row],[GT]],tScores[GT])+(COUNTIF($AE$3:$AE34,tScores[[#This Row],[GT]]))-1)","v":3}]
[18,"E",{"$f":"IF(tScores[[#This Row],[Name]]=\"\",\"\",tScores[[#This Row],[Lane]]&\"-\"&tScores[[#This Row],[Pos]])","v":"18-E"},"Charlie Brown II",232,215,202,214,{"$f":"IFERROR(IF(tScores[[#This Row],[Name]]=\"\",\"\",SUM(tScores[[#This Row],[Game1]:[Game4]]))+MAX(tScores[[#This Row],[Game1]:[Game4]])/10000,\"\")","v":863.02319999999997},{"$f":"IF(tScores[[#This Row],[Name]]=\"\",\"\",RANK(tScores[[#This Row],[Total]],tScores[Total])+(COUNTIF($I$3:$I35,tScores[[#This Row],[Total]]))-1)","v":17},{"$f":"IFERROR(VLOOKUP(tScores[[#This Row],[Name]],RRGM1,2,0),\"\")","v":""},{"$f":"IFERROR(VLOOKUP(tScores[[#This Row],[Name]],RRGM2,2,0),\"\")","v":""},{"$f":"IFERROR(VLOOKUP(tScores[[#This Row],[Name]],RRGM3,2,0),\"\")","v":""},{"$f":"IFERROR(VLOOKUP(tScores[[#This Row],[Name]],RRGM4,2,0),\"\")","v":""},{"$f":"IFERROR(VLOOKUP(tScores[[#This Row],[Name]],RRGM5,2,0),\"\")","v":""},{"$f":"IFERROR(VLOOKUP(tScores[[#This Row],[Name]],RRGM6,2,0),\"\")","v":""},{"$f":"IFERROR(VLOOKUP(tScores[[#This Row],[Name]],RRGM7,2,0),\"\")","v":""},{"$f":"SUM(tScores[[#This Row],[RR1]:[RR7]])+MAX(tScores[[#This Row],[RANK1]:[RR7]])/10000","v":1.6999999999999999E-3},{"$f":"IFERROR(VLOOKUP(tScores[[#This Row],[Name]],RRGM1,3,0),\"\")","v":""},{"$f":"IFERROR(VLOOKUP(tScores[[#This Row],[Name]],RRGM2,3,0),\"\")","v":""},{"$f":"IFERROR(VLOOKUP(tScores[[#This Row],[Name]],RRGM3,3,0),\"\")","v":""},{"$f":"IFERROR(VLOOKUP(tScores[[#This Row],[Name]],RRGM4,3,0),\"\")","v":""},{"$f":"IFERROR(VLOOKUP(tScores[[#This Row],[Name]],RRGM5,3,0),\"\")","v":""},{"$f":"IFERROR(VLOOKUP(tScores[[#This Row],[Name]],RRGM6,3,0),\"\")","v":""},{"$f":"IFERROR(VLOOKUP(tScores[[#This Row],[Name]],RRGM7,3,0),\"\")","v":""},{"$f":"SUM(tScores[[#This Row],[B1]:[B7]])","v":0},{"$f":"IFERROR(tScores[[#This Row],[Total]]+tScores[[#This Row],[RR Total]]+tScores[[#This Row],[Btotal]],\"\")","v":863.0249},{"$f":"IF(tScores[[#This Row],[Name]]=\"\",\"\",RANK(tScores[[#This Row],[SUBTotal]],tScores[SUBTotal])+(COUNTIF($AA$3:$AA35,tScores[[#This Row],[SUBTotal]]))-1)","v":17},{"$f":"IFERROR(VLOOKUP(tScores[[#This Row],[Name]],RRGM8,2,0),\"\")","v":""},{"$f":"IFERROR(VLOOKUP(tScores[[#This Row],[Name]],RRGM8,3,0),\"\")","v":""},{"$f":"IFERROR(tScores[[#This Row],[SUBTotal]]+SUM(tScores[[#This Row],[RR8]:[B8]]),\"\")","v":863.0249},{"$f":"IF(tScores[[#This Row],[Name]]=\"\",\"\",RANK(tScores[[#This Row],[GT]],tScores[GT])+(COUNTIF($AE$3:$AE35,tScores[[#This Row],[GT]]))-1)","v":17}]

{"sheet":"Round Robin-StepLadder","index":1,"n_rows":33,"n_cols":25,"rows_kept":33,"cut":false,"hidden":false,"merged":[[14,1,15,1],[16,1,17,1],[18,1,19,1],[20,1,21,1],[3,1,4,1],[5,1,6,1],[7,1,8,1],[9,1,10,1],[23,21,23,24],[1,20,1,24],[12,20,12,24],[23,5,23,8],[23,4,24,4],[23,13,23,20],[1,2,1,6],[12,2,12,6],[1,8,1,12],[12,8,12,12],[1,14,1,18],[12,14,12,18],[23,9,23,12],[31,22,31,23],[32,22,32,23],[24,22,24,23],[30,13,30,15],[27,15,27,17],[24,17,24,20],[25,22,25,23],[26,22,26,23],[27,22,27,23],[28,22,28,23],[29,22,29,23],[30,22,30,23],[24,14,24,15]]}
[]
[null,null,"Game 1",null,null,null,null,null,"Game 2",null,null,null,null,null,"Game 3",null,null,null,null,null,"Game 4"]
[null,"Lanes","Seed","Name","Score","Bonus","Total",null,"Seed","Name","Score","Bonus","Total",null,"Seed","Name","Score","Bonus","Total",null,"Seed","Name","Score","Bonus","Total"]
[{"$f":"B4","v":" 5-6"}," 5-6",1,{"$f":"IFERROR(VLOOKUP(C4,QUAL,2,0),\"\")","v":"George Miller"},236,{"$f":"IF(E4=\"\",\"\",IF(E4=E5,15,IF(E4>E5,30,0)))","v":30},{"$f":"IFERROR(E4+F4,\"\")","v":266},null,6,{"$f":"IFERROR(VLOOKUP(I4,QUAL,2,0),\"\")","v":"Steve Marcus"},145,{"$f":"IF(K4=\"\",\"\",IF(K4=K5,15,IF(K4>K5,30,0)))","v":0},{"$f":"IFERROR(K4+L4,\"\")","v":145},null,5,{"$f":"IFERROR(VLOOKUP(O4,QUAL,2,0),\"\")","v":"Chris Slagter"},189,{"$f":"IF(Q4=\"\",\"\",IF(Q4=Q5,15,IF(Q4>Q5,30,0)))","v":0},{"$f":"IFERROR(Q4+R4,\"\")","v":189},null,3,{"$f":"IFERROR(VLOOKUP(U4,QUAL,2,0),\"\")","v":"Eric Scott"},170,{"$f":"IF(W4=\"\",\"\",IF(W4=W5,15,IF(W4>W5,30,0)))","v":0},{"$f":"IFERROR(W4+X4,\"\")","v":170}]
[{"$f":"B4","v":" 5-6"},null,2,"Mike Smith Jr",203,{"$f":"IFERROR(30-F4,\"\")","v":0},{"$f":"IFERROR(E5+F5,\"\")","v":203},null,8,"Mike Horian",223,{"$f":"IFERROR(30-L4,\"\")","v":30},{"$f":"IFERROR(K5+L5,\"\")","v":253},null,4,"Aaron Groendyk",245,{"$f":"IFERROR(30-R4,\"\")","v":30},{"$f":"IFERROR(Q5+R5,\"\")","v":275},null,6,"Steve Marcus",192,{"$f":"IFERROR(30-X4,\"\")","v":30},{"$f":"IFERROR(W5+X5,\"\")","v":222}]
[{"$f":"B6","v":" 7-8"}," 7-8",3,"Eric Scott",216,{"$f":"IF(E6=\"\",\"\",IF(E6=E7,15,IF(E6>E7,30,0)))","v":0},216,null,5,"Chris Slagter",229,{"$f":"IF(K6=\"\",\"\",IF(K6=K7,15,IF(K6>K7,30,0)))","v":0},229,null,1,"George Miller",161,{"$f":"IF(Q6=\"\",\"\",IF(Q6=Q7,15,IF(Q6>Q7,30,0)))","v":0},161,null,7,"Ben Rabourn",224,{"$f":"IF(W6=\"\",\"\",IF(W6=W7,15,IF(W6>W7,30,0)))","v":30},254]
[{"$f":"B6","v":" 7-8"},null,4,"Aaron Groendyk",257,{"$f":"IFERROR(30-F6,\"\")","v":30},287,null,7,"Ben Rabourn",268,{"$f":"IFERROR(30-L6,\"\")","v":30},298,null,8,"Mike Horian",179,{"$f":"IFERROR(30-R6,\"\")","v":30},209,null,2,"Mike Smith Jr",194,{"$f":"IFERROR(30-X6,\"\")","v":0},194]
[{"$f":"B8","v":" 9-10"}," 9-10",5,"Chris Slagter",220,{"$f":"IF(E8=\"\",\"\",IF(E8=E9,15,IF(E8>E9,30,0)))","v":0},220,null,2,"Mike Smith Jr",223,{"$f":"IF(K8=\"\",\"\",IF(K8=K9,15,IF(K8>K9,30,0)))","v":30},253,null,7,"Ben Rabourn",258,{"$f":"IF(Q8=\"\",\"\",IF(Q8=Q9,15,IF(Q8>Q9,30,0)))","v":30},288,null,1,"George Miller",209,{"$f":"IF(W8=\"\",\"\",IF(W8=W9,15,IF(W8>W9,30,0)))","v":30},239]
[{"$f":"B8","v":" 9-10"},null,6,"Steve Marcus",235,{"$f":"IFERROR(30-F8,\"\")","v":30},265,null,4,"Aaron Groendyk",216,{"$f":"IFERROR(30-L8,\"\")","v":0},216,null,3,"Eric Scott",172,{"$f":"IFERROR(30-R8,\"\")","v":0},172,null,5,"Chris Slagter",197,{"$f":"IFERROR(30-X8,\"\")","v":0},197]
[{"$f":"B10","v":"11-12"},"11-12",7,"Ben Rabourn",247,{"$f":"IF(E10=\"\",\"\",IF(E10=E11,15,IF(E10>E11,30,0)))","v":30},277,null,1,"George Miller",204,{"$f":"IF(K10=\"\",\"\",IF(K10=K11,15,IF(K10>K11,30,0)))","v":30},234,null,2,"Mike Smith Jr",182,{"$f":"IF(Q10=\"\",\"\",IF(Q10=Q11,15,IF(Q10>Q11,30,0)))","v":0},182,null,8,"Mike Horian",204,{"$f":"IF(W10=\"\",\"\",IF(W10=W11,15,IF(W10>W11,30,0)))","v":0},204]
[{"$f":"B10","v":"11-12"},null,8,"Mike Horian",151,{"$f":"IFERROR(30-F10,\"\")","v":0},151,null,3,"Eric Scott",174,{"$f":"IFERROR(30-L10,\"\")","v":0},174,null,6,"Steve Marcus",195,{"$f":"IFERROR(30-R10,\"\")","v":30},225,null,4,"Aaron Groendyk",217,{"$f":"IFERROR(30-X10,\"\")","v":30},247]
[]
[null,null,"Game 5",null,null,null,null,null,"Game 6",null,null,null,null,null,"Game 7",null,null,null,null,null,"Game 8"]
[null,"Lanes","Seed","Name","Score","Bonus","Total",null,"Seed","Name","Score","Bonus","Total",null,"Seed","Name","Score","Bonus","Total",null,"Seed","Name","Score","Bonus","Total"]
[{"$f":"B15","v":" 5-6"},{"$f":"B4","v":" 5-6"},7,{"$f":"IFERROR(VLOOKUP(C15,QUAL,2,0),\"\")","v":"Ben Rabourn"},246,{"$f":"IF(E15=\"\",\"\",IF(E15=E16,15,IF(E15>E16,30,0)))","v":30},{"$f":"IFERROR(E15+F15,\"\")","v":276},null,2,{"$f":"IFERROR(VLOOKUP(I15,QUAL,2,0),\"\")","v":"Mike Smith Jr"},228,{"$f":"IF(K15=\"\",\"\",IF(K15=K16,15,IF(K15>K16,30,0)))","v":30},{"$f":"IFERROR(K15+L15,\"\")","v":258},null,4,{"$f":"IFERROR(VLOOKUP(O15,QUAL,2,0),\"\")","v":"Aaron Groendyk"},215,{"$f":"IF(Q15=\"\",\"\",IF(Q15=Q16,15,IF(Q15>Q16,30,0)))","v":0},{"$f":"IFERROR(Q15+R15,\"\")","v":215},null,1,{"$f":"IFERROR(INDEX(BNAME,MATCH(C26,RANKST,0),1),\"\")","v":"Ben Rabourn"},204,{"$f":"IF(W15=\"\",\"\",IF(W15=W16,15,IF(W15>W16,30,0)))","v":0},{"$f":"IFERROR(W15+X15,\"\")","v":204}]
[{"$f":"B15","v":" 5-6"},null,1,"George Miller",179,{"$f":"IFERROR(30-F15,\"\")","v":0},{"$f":"IFERROR(E16+F16,\"\")","v":179},null,3,"Eric Scott",182,{"$f":"IFERROR(30-L15,\"\")","v":0},{"$f":"IFERROR(K16+L16,\"\")","v":182},null,7,"Ben Rabourn",267,{"$f":"IFERROR(30-R15,\"\")","v":30},{"$f":"IFERROR(Q16+R16,\"\")","v":297},null,2,"Aaron Groendyk",222,{"$f":"IFERROR(30-X15,\"\")","v":30},{"$f":"IFERROR(W16+X16,\"\")","v":252}]
[{"$f":"B17","v":" 7-8"},{"$f":"B6","v":" 7-8"},4,"Aaron Groendyk",227,{"$f":"IF(E17=\"\",\"\",IF(E17=E18,15,IF(E17>E18,30,0)))","v":30},257,null,8,"Mike Horian",252,{"$f":"IF(K17=\"\",\"\",IF(K17=K18,15,IF(K17>K18,30,0)))","v":30},282,null,6,"Steve Marcus",195,{"$f":"IF(Q17=\"\",\"\",IF(Q17=Q18,15,IF(Q17>Q18,30,0)))","v":30},225,null,3,"Mike Smith Jr",195,{"$f":"IF(W17=\"\",\"\",IF(W17=W18,15,IF(W17>W18,30,0)))","v":0},195]
[{"$f":"B17","v":" 7-8"},null,6,"Steve Marcus",190,{"$f":"IFERROR(30-F17,\"\")","v":0},190,null,5,"Chris Slagter",176,{"$f":"IFERROR(30-L17,\"\")","v":0},176,null,1,"George Miller",184,{"$f":"IFERROR(30-R17,\"\")","v":0},184,null,4,"George Miller",230,{"$f":"IFERROR(30-X17,\"\")","v":30},260]
[{"$f":"B19","v":" 9-10"},{"$f":"B8","v":" 9-10"},3,"Eric Scott",232,{"$f":"IF(E19=\"\",\"\",IF(E19=E20,15,IF(E19>E20,30,0)))","v":0},232,null,4,"Aaron Groendyk",181,{"$f":"IF(K19=\"\",\"\",IF(K19=K20,15,IF(K19>K20,30,0)))","v":0},181,null,8,"Mike Horian",224,{"$f":"IF(Q19=\"\",\"\",IF(Q19=Q20,15,IF(Q19>Q20,30,0)))","v":0},224,null,5,"Mike Horian",180,{"$f":"IF(W19=\"\",\"\",IF(W19=W20,15,IF(W19>W20,30,0)))","v":0},180]
[{"$f":"B19","v":" 9-10"},null,8,"Mike Horian",238,{"$f":"IFERROR(30-F19,\"\")","v":30},268,null,1,"George Miller",229,{"$f":"IFERROR(30-L19,\"\")","v":30},259,null,2,"Mike Smith Jr",233,{"$f":"IFERROR(30-R19,\"\")","v":30},263,null,6,"Chris Slagter",209,{"$f":"IFERROR(30-X19,\"\")","v":30},239]
[{"$f":"B21","v":"11-12"},{"$f":"B10","v":"11-12"},5,"Chris Slagter",216,{"$f":"IF(E21=\"\",\"\",IF(E21=E22,15,IF(E21>E22,30,0)))","v":30},246,null,6,"Steve Marcus",214,{"$f":"IF(K21=\"\",\"\",IF(K21=K22,15,IF(K21>K22,30,0)))","v":0},214,null,3,"Eric Scott",147,{"$f":"IF(Q21=\"\",\"\",IF(Q21=Q22,15,IF(Q21>Q22,30,0)))","v":0},147,null,7,"Steve Marcus",197,{"$f":"IF(W21=\"\",\"\",IF(W21=W22,15,IF(W21>W22,30,0)))","v":30},227]
[{"$f":"B21","v":"11-12"},null,2,"Mike Smith Jr",206,{"$f":"IFERROR(30-F21,\"\")","v":0},206,null,7,"Ben Rabourn",258,{"$f":"IFERROR(30-L21,\"\")","v":30},288,null,5,"Chris Slagter",259,{"$f":"IFERROR(30-R21,\"\")","v":30},289,null,8,"Eric Scott",151,{"$f":"IFERROR(30-X21,\"\")","v":0},151]
[]
[null,null,null,null,"Qual","ROUND ROBIN",null,null,null,"POSITION ROUND",null,null,null,"STEPLADDER FINALS",null,null,null,null,null,null,null,"FINAL STANDINGS"]
[null,null,"Rank","Name",null,"GMS 1-7","Bonus",null,"Total","Game 8","Bonus","Grand Total","+/- \n4th Place",null,"Lanes 3-4",null,null,"CHAMPIONSHIP",null,null,null,"Place","Name",null,"AVG"]
[null,null,1,{"$f":"IFERROR(INDEX(BNAME,MATCH(C26,IF(W$22=\"\",RANKST,RANKGT),0),1),\"\")","v":"Ben Rabourn"},{"$f":"IFERROR(INDEX(QTOTAL,MATCH(C26,IF(W$22=\"\",RANKST,RANKGT),0),1),\"\")","v":921.02380000000005},{"$f":"IFERROR(INDEX(RRTotal,MATCH(C26,IF(W$22=\"\",RANKST,RANKGT),0),1),\"\")","v":1768.0268000000001},{"$f":"IFERROR(INDEX(BTotal,MATCH(C26,IF(W$22=\"\",RANKST,RANKGT),0),1),\"\")","v":210},null,{"$f":"IFERROR(F26+G26,\"\")","v":1978.0268000000001},{"$f":"IFERROR(INDEX(Game8,MATCH(C26,IF(W$22=\"\",RANKST,RANKGT),0),1),\"\")","v":204},{"$f":"IFERROR(INDEX(Bonus8,MATCH(C26,IF(W$22=\"\",RANKST,RANKGT),0),1),\"\")","v":0},{"$f":"IFERROR(SUM(J26:K26)+I26+E26,\"\")","v":3103.0506},{"$f":"IFERROR(L26-$L$29,\"\")","v":362.99739999999974},null,null,null,null,1,{"$f":"IF($W$22=\"\",\"\",VLOOKUP(R26,$C$26:$D$33,2,0))","v":"Ben Rabourn"},null,233,1,{"$f":"IF(U26=\"\",\"\",IF(U26<U27,S27,S26))","v":"Ben Rabourn"},null,{"$f":"IFERROR(IF(W26=\"\",\"\",(VLOOKUP(W26,$D$26:$E$33,2,0)+VLOOKUP(W26,$D$26:$F$33,3,0)+VLOOKUP(W26,$D$26:$J$33,7,0)+SUMIF($O$32:$O$33,W26,$P$32:$P$33)+SUMIF($Q$29:$Q$30,W26,$R$29:$R$30)+SUMIF($S$26:$S$27,W26,$U$26:$U$27)))/(12+COUNTIF($N$26:$S$33,W26)),\"\")","v":240.46543076923078}]
[null,null,2,"Aaron Groendyk",937.02689999999996,1558.0256999999999,120,null,{"$f":"IFERROR(F27+G27,\"\")","v":1678.0256999999999},222,30,{"$f":"IFERROR(SUM(J27:K27)+I27+E27,\"\")","v":2867.0526},{"$f":"IFERROR(L27-$L$29,\"\")","v":126.9993999999997},null,null,null,null,"M2 Winner",{"$f":"IF(R29=\"\",\"\",IF(R29>R30,Q29,Q30))","v":"Mike Smith Jr"},null,205,2,{"$f":"IF(U26=\"\",\"\",IF(U26<U27,S26,S27))","v":"Mike Smith Jr"},null,{"$f":"IFERROR(IF(W27=\"\",\"\",(VLOOKUP(W27,$D$26:$E$33,2,0)+VLOOKUP(W27,$D$26:$F$33,3,0)+VLOOKUP(W27,$D$26:$J$33,7,0)+SUMIF($O$32:$O$33,W27,$P$32:$P$33)+SUMIF($Q$29:$Q$30,W27,$R$29:$R$30)+SUMIF($S$26:$S$27,W27,$U$26:$U$27)))/(12+COUNTIF($N$26:$S$33,W27)),\"\")","v":223.20354666666668}]
[null,null,3,"George Miller",991.03,1402.0236,120,null,1522.0236,230,30,2773.0536000000002,33.0003999999999,null,null,"SEMI FINALS",null,null,null,null,null,3,{"$f":"IF(R29=\"\",\"\",IF(R29<R30,Q29,Q30))","v":"Aaron Groendyk"},null,{"$f":"IFERROR(IF(W28=\"\",\"\",(VLOOKUP(W28,$D$26:$E$33,2,0)+VLOOKUP(W28,$D$26:$F$33,3,0)+VLOOKUP(W28,$D$26:$J$33,7,0)+SUMIF($O$32:$O$33,W28,$P$32:$P$33)+SUMIF($Q$29:$Q$30,W28,$R$29:$R$30)+SUMIF($S$26:$S$27,W28,$U$26:$U$27)))/(12+COUNTIF($N$26:$S$33,W28)),\"\")","v":227.31173846153845}]
[null,null,4,"Mike Smith Jr",986.0299,1469.0233000000001,90,null,1559.0233000000001,195,0,2740.0532000000003,0,null,null,2,{"$f":"IF($W$22=\"\",\"\",VLOOKUP(P29,$C$26:$D$33,2,0))","v":"Aaron Groendyk"},238,null,null,null,4,{"$f":"IF(P32=\"\",\"\",IF(P32<P33,O32,O33))","v":"George Miller"},null,{"$f":"IFERROR(IF(W29=\"\",\"\",(VLOOKUP(W29,$D$26:$E$33,2,0)+VLOOKUP(W29,$D$26:$F$33,3,0)+VLOOKUP(W29,$D$26:$J$33,7,0)+SUMIF($O$32:$O$33,W29,$P$32:$P$33)+SUMIF($Q$29:$Q$30,W29,$R$29:$R$30)+SUMIF($S$26:$S$27,W29,$U$26:$U$27)))/(12+COUNTIF($N$26:$S$33,W29)),\"\")","v":218.85027692307693}]
[null,null,5,"Chris Slagter",936.02589999999998,1486.0259000000001,60,null,1546.0259000000001,209,30,2721.0518000000002,-19.001400000000103,null,null,"M1 Winner",{"$f":"IF(P32=\"\",\"\",IF(P32>P33,O32,O33))","v":"Mike Smith Jr"},255,null,null,null,5,{"$f":"IF($W$22=\"\",\"\",VLOOKUP(V30,$C$26:$D$33,2,0))","v":"Chris Slagter"},{"$error":"#N/A"},{"$f":"IF(W30=\"\",\"\",SUM(E30+F30+J30)/12)","v":219.25431666666668}]
[null,null,6,"Mike Horian",918.02679999999998,1471.0252,120,null,1591.0252,180,0,2689.0520000000001,-51.001200000000154,"MATCH 1",null,null,null,null,null,null,null,6,"Mike Horian",{"$error":"#N/A"},{"$f":"IF(W31=\"\",\"\",SUM(E31+F31+J31)/12)","v":214.08766666666668}]
[null,null,7,"Steve Marcus",932.0249,1366.0235,120,null,1486.0235,197,30,2645.0484000000001,-95.004800000000159,3,{"$f":"IF($W$22=\"\",\"\",VLOOKUP(N32,$C$26:$D$33,2,0))","v":"George Miller"},222,null,null,null,null,null,7,"Steve Marcus",{"$error":"#N/A"},207.92070000000001]
[null,null,8,"Eric Scott",974.02679999999998,1293.0232000000001,0,null,1293.0232000000001,151,0,2418.0500000000002,-322.00320000000011,4,{"$f":"IF($W$22=\"\",\"\",VLOOKUP(N33,$C$26:$D$33,2,0))","v":"Mike Smith Jr"},238,null,null,null,null,null,8,"Eric Scott",{"$error":"#N/A"},201.50416666666669]

{"sheet":"Standings","index":2,"n_rows":65,"n_cols":8,"rows_kept":65,"cut":false,"hidden":false,"merged":[[0,1,0,7]]}
[null,"Qualifying Results"]
[null,"Rank","Name","Game 1","Game 2","Game 3","Game 4","Total"]
[null,{"$f":"IF(ROW(C2)-1<=Bowlers,SMALL(tScores[RANK1],ROW(C2)-1),\"\")","v":1},{"$f":"IF($B3=\"\",\"\",INDEX(tScores[Name],MATCH(Standings!$B3,tScores[RANK1],0),1))","v":"George Miller"},{"$f":"IF($B3=\"\",\"\",INDEX(tScores[Game1],MATCH(Standings!$B3,tScores[RANK1],0),1))","v":234},{"$f":"IF($B3=\"\",\"\",INDEX(tScores[Game2],MATCH(Standings!$B3,tScores[RANK1],0),1))","v":200},{"$f":"IF($B3=\"\",\"\",INDEX(tScores[Game3],MATCH(Standings!$B3,tScores[RANK1],0),1))","v":300},{"$f":"IF($B3=\"\",\"\",INDEX(tScores[Game4],MATCH(Standings!$B3,tScores[RANK1],0),1))","v":257},{"$f":"IF($B3=\"\",\"\",INDEX(tScores[Total],MATCH(Standings!$B3,tScores[RANK1],0),1))","v":991.03}]
[null,{"$f":"IF(ROW(C3)-1<=Bowlers,SMALL(tScores[RANK1],ROW(C3)-1),\"\")","v":2},{"$f":"IF($B4=\"\",\"\",INDEX(tScores[Name],MATCH(Standings!$B4,tScores[RANK1],0),1))","v":"Mike Smith Jr"},{"$f":"IF($B4=\"\",\"\",INDEX(tScores[Game1],MATCH(Standings!$B4,tScores[RANK1],0),1))","v":262},{"$f":"IF($B4=\"\",\"\",INDEX(tScores[Game2],MATCH(Standings!$B4,tScores[RANK1],0),1))","v":299},{"$f":"IF($B4=\"\",\"\",INDEX(tScores[Game3],MATCH(Standings!$B4,tScores[RANK1],0),1))","v":238},{"$f":"IF($B4=\"\",\"\",INDEX(tScores[Game4],MATCH(Standings!$B4,tScores[RANK1],0),1))","v":187},{"$f":"IF($B4=\"\",\"\",INDEX(tScores[Total],MATCH(Standings!$B4,tScores[RANK1],0),1))","v":986.0299}]
[null,{"$f":"IF(ROW(C4)-1<=Bowlers,SMALL(tScores[RANK1],ROW(C4)-1),\"\")","v":3},{"$f":"IF($B5=\"\",\"\",INDEX(tScores[Name],MATCH(Standings!$B5,tScores[RANK1],0),1))","v":"Eric Scott"},{"$f":"IF($B5=\"\",\"\",INDEX(tScores[Game1],MATCH(Standings!$B5,tScores[RANK1],0),1))","v":257},{"$f":"IF($B5=\"\",\"\",INDEX(tScores[Game2],MATCH(Standings!$B5,tScores[RANK1],0),1))","v":238},{"$f":"IF($B5=\"\",\"\",INDEX(tScores[Game3],MATCH(Standings!$B5,tScores[RANK1],0),1))","v":268},{"$f":"IF($B5=\"\",\"\",INDEX(tScores[Game4],MATCH(Standings!$B5,tScores[RANK1],0),1))","v":211},{"$f":"IF($B5=\"\",\"\",INDEX(tScores[Total],MATCH(Standings!$B5,tScores[RANK1],0),1))","v":974.02679999999998}]
[null,{"$f":"IF(ROW(C5)-1<=Bowlers,SMALL(tScores[RANK1],ROW(C5)-1),\"\")","v":4},{"$f":"IF($B6=\"\",\"\",INDEX(tScores[Name],MATCH(Standings!$B6,tScores[RANK1],0),1))","v":"Aaron Groendyk"},{"$f":"IF($B6=\"\",\"\",INDEX(tScores[Game1],MATCH(Standings!$B6,tScores[RANK1],0),1))","v":234},{"$f":"IF($B6=\"\",\"\",INDEX(tScores[Game2],MATCH(Standings!$B6,tScores[RANK1],0),1))","v":269},{"$f":"IF($B6=\"\",\"\",INDEX(tScores[Game3],MATCH(Standings!$B6,tScores[RANK1],0),1))","v":226},{"$f":"IF($B6=\"\",\"\",INDEX(tScores[Game4],MATCH(Standings!$B6,tScores[RANK1],0),1))","v":208},{"$f":"IF($B6=\"\",\"\",INDEX(tScores[Total],MATCH(Standings!$B6,tScores[RANK1],0),1))","v":937.02689999999996}]
[null,{"$f":"IF(ROW(C6)-1<=Bowlers,SMALL(tScores[RANK1],ROW(C6)-1),\"\")","v":5},{"$f":"IF($B7=\"\",\"\",INDEX(tScores[Name],MATCH(Standings!$B7,tScores[RANK1],0),1))","v":"Chris Slagter"},{"$f":"IF($B7=\"\",\"\",INDEX(tScores[Game1],MATCH(Standings!$B7,tScores[RANK1],0),1))","v":227},{"$f":"IF($B7=\"\",\"\",INDEX(tScores[Game2],MATCH(Standings!$B7,tScores[RANK1],0),1))","v":259},{"$f":"IF($B7=\"\",\"\",INDEX(tScores[Game3],MATCH(Standings!$B7,tScores[RANK1],0),1))","v":237},{"$f":"IF($B7=\"\",\"\",INDEX(tScores[Game4],MATCH(Standings!$B7,tScores[RANK1],0),1))","v":213},{"$f":"IF($B7=\"\",\"\",INDEX(tScores[Total],MATCH(Standings!$B7,tScores[RANK1],0),1))","v":936.02589999999998}]
[null,{"$f":"IF(ROW(C7)-1<=Bowlers,SMALL(tScores[RANK1],ROW(C7)-1),\"\")","v":6},{"$f":"IF($B8=\"\",\"\",INDEX(tScores[Name],MATCH(Standings!$B8,tScores[RANK1],0),1))","v":"Steve Marcus"},{"$f":"IF($B8=\"\",\"\",INDEX(tScores[Game1],MATCH(Standings!$B8,tScores[RANK1],0),1))","v":249},{"$f":"IF($B8=\"\",\"\",INDEX(tScores[Game2],MATCH(Standings!$B8,tScores[RANK1],0),1))","v":237},{"$f":"IF($B8=\"\",\"\",INDEX(tScores[Game3],MATCH(Standings!$B8,tScores[RANK1],0),1))","v":213},{"$f":"IF($B8=\"\",\"\",INDEX(tScores[Game4],MATCH(Standings!$B8,tScores[RANK1],0),1))","v":233},{"$f":"IF($B8=\"\",\"\",INDEX(tScores[Total],MATCH(Standings!$B8,tScores[RANK1],0),1))","v":932.0249}]
[null,{"$f":"IF(ROW(C8)-1<=Bowlers,SMALL(tScores[RANK1],ROW(C8)-1),\"\")","v":7},{"$f":"IF($B9=\"\",\"\",INDEX(tScores[Name],MATCH(Standings!$B9,tScores[RANK1],0),1))","v":"Ben Rabourn"},{"$f":"IF($B9=\"\",\"\",INDEX(tScores[Game1],MATCH(Standings!$B9,tScores[RANK1],0),1))","v":236},{"$f":"IF($B9=\"\",\"\",INDEX(tScores[Game2],MATCH(Standings!$B9,tScores[RANK1],0),1))","v":224},{"$f":"IF($B9=\"\",\"\",INDEX(tScores[Game3],MATCH(Standings!$B9,tScores[RANK1],0),1))","v":223},{"$f":"IF($B9=\"\",\"\",INDEX(tScores[Game4],MATCH(Standings!$B9,tScores[RANK1],0),1))","v":238},{"$f":"IF($B9=\"\",\"\",INDEX(tScores[Total],MATCH(Standings!$B9,tScores[RANK1],0),1))","v":921.02380000000005}]
[null,{"$f":"IF(ROW(C9)-1<=Bowlers,SMALL(tScores[RANK1],ROW(C9)-1),\"\")","v":8},{"$f":"IF($B10=\"\",\"\",INDEX(tScores[Name],MATCH(Standings!$B10,tScores[RANK1],0),1))","v":"Mike Horian"},{"$f":"IF($B10=\"\",\"\",INDEX(tScores[Game1],MATCH(Standings!$B10,tScores[RANK1],0),1))","v":216},{"$f":"IF($B10=\"\",\"\",INDEX(tScores[Game2],MATCH(Standings!$B10,tScores[RANK1],0),1))","v":268},{"$f":"IF($B10=\"\",\"\",INDEX(tScores[Game3],MATCH(Standings!$B10,tScores[RANK1],0),1))","v":210},{"$f":"IF($B10=\"\",\"\",INDEX(tScores[Game4],MATCH(Standings!$B10,tScores[RANK1],0),1))","v":224},{"$f":"IF($B10=\"\",\"\",INDEX(tScores[Total],MATCH(Standings!$B10,tScores[RANK1],0),1))","v":918.02679999999998}]
[null,{"$f":"IF(ROW(C10)-1<=Bowlers,SMALL(tScores[RANK1],ROW(C10)-1),\"\")","v":9},{"$f":"IF($B11=\"\",\"\",INDEX(tScores[Name],MATCH(Standings!$B11,tScores[RANK1],0),1))","v":"Randy Hawks"},{"$f":"IF($B11=\"\",\"\",INDEX(tScores[Game1],MATCH(Standings!$B11,tScores[RANK1],0),1))","v":245},{"$f":"IF($B11=\"\",\"\",INDEX(tScores[Game2],MATCH(Standings!$B11,tScores[RANK1],0),1))","v":241},{"$f":"IF($B11=\"\",\"\",INDEX(tScores[Game3],MATCH(Standings!$B11,tScores[RANK1],0),1))","v":246},{"$f":"IF($B11=\"\",\"\",INDEX(tScores[Game4],MATCH(Standings!$B11,tScores[RANK1],0),1))","v":181},{"$f":"IF($B11=\"\",\"\",INDEX(tScores[Total],MATCH(Standings!$B11,tScores[RANK1],0),1))","v":913.02459999999996}]
[null,{"$f":"IF(ROW(C11)-1<=Bowlers,SMALL(tScores[RANK1],ROW(C11)-1),\"\")","v":10},{"$f":"IF($B12=\"\",\"\",INDEX(tScores[Name],MATCH(Standings!$B12,tScores[RANK1],0),1))","v":"Jeremy Bartz"},{"$f":"IF($B12=\"\",\"\",INDEX(tScores[Game1],MATCH(Standings!$B12,tScores[RANK1],0),1))","v":205},{"$f":"IF($B12=\"\",\"\",INDEX(tScores[Game2],MATCH(Standings!$B12,tScores[RANK1],0),1))","v":196},{"$f":"IF($B12=\"\",\"\",INDEX(tScores[Game3],MATCH(Standings!$B12,tScores[RANK1],0),1))","v":256},{"$f":"IF($B12=\"\",\"\",INDEX(tScores[Game4],MATCH(Standings!$B12,tScores[RANK1],0),1))","v":236},{"$f":"IF($B12=\"\",\"\",INDEX(tScores[Total],MATCH(Standings!$B12,tScores[RANK1],0),1))","v":893.02560000000005}]
[null,{"$f":"IF(ROW(C12)-1<=Bowlers,SMALL(tScores[RANK1],ROW(C12)-1),\"\")","v":11},{"$f":"IF($B13=\"\",\"\",INDEX(tScores[Name],MATCH(Standings!$B13,tScores[RANK1],0),1))","v":"Don Veltman"},{"$f":"IF($B13=\"\",\"\",INDEX(tScores[Game1],MATCH(Standings!$B13,tScores[RANK1],0),1))","v":259},{"$f":"IF($B13=\"\",\"\",INDEX(tScores[Game2],MATCH(Standings!$B13,tScores[RANK1],0),1))","v":196},{"$f":"IF($B13=\"\",\"\",INDEX(tScores[Game3],MATCH(Standings!$B13,tScores[RANK1],0),1))","v":214},{"$f":"IF($B13=\"\",\"\",INDEX(tScores[Game4],MATCH(Standings!$B13,tScores[RANK1],0),1))","v":217},{"$f":"IF($B13=\"\",\"\",INDEX(tScores[Total],MATCH(Standings!$B13,tScores[RANK1],0),1))","v":886.02589999999998}]
[null,{"$f":"IF(ROW(C13)-1<=Bowlers,SMALL(tScores[RANK1],ROW(C13)-1),\"\")","v":12},{"$f":"IF($B14=\"\",\"\",INDEX(tScores[Name],MATCH(Standings!$B14,tScores[RANK1],0),1))","v":"Ryan Ross"},{"$f":"IF($B14=\"\",\"\",INDEX(tScores[Game1],MATCH(Standings!$B14,tScores[RANK1],0),1))","v":226},{"$f":"IF($B14=\"\",\"\",INDEX(tScores[Game2],MATCH(Standings!$B14,tScores[RANK1],0),1))","v":206},{"$f":"IF($B14=\"\",\"\",INDEX(tScores[Game3],MATCH(Standings!$B14,tScores[RANK1],0),1))","v":215},{"$f":"IF($B14=\"\",\"\",INDEX(tScores[Game4],MATCH(Standings!$B14,tScores[RANK1],0),1))","v":227},{"$f":"IF($B14=\"\",\"\",INDEX(tScores[Total],MATCH(Standings!$B14,tScores[RANK1],0),1))","v":874.02269999999999}]
[null,{"$f":"IF(ROW(C14)-1<=Bowlers,SMALL(tScores[RANK1],ROW(C14)-1),\"\")","v":13},{"$f":"IF($B15=\"\",\"\",INDEX(tScores[Name],MATCH(Standings!$B15,tScores[RANK1],0),1))","v":"John Thomasma"},{"$f":"IF($B15=\"\",\"\",INDEX(tScores[Game1],MATCH(Standings!$B15,tScores[RANK1],0),1))","v":241},{"$f":"IF($B15=\"\",\"\",INDEX(tScores[Game2],MATCH(Standings!$B15,tScores[RANK1],0),1))","v":178},{"$f":"IF($B15=\"\",\"\",INDEX(tScores[Game3],MATCH(Standings!$B15,tScores[RANK1],0),1))","v":239},{"$f":"IF($B15=\"\",\"\",INDEX(tScores[Game4],MATCH(Standings!$B15,tScores[RANK1],0),1))","v":215},{"$f":"IF($B15=\"\",\"\",INDEX(tScores[Total],MATCH(Standings!$B15,tScores[RANK1],0),1))","v":873.02409999999998}]
[null,{"$f":"IF(ROW(C15)-1<=Bowlers,SMALL(tScores[RANK1],ROW(C15)-1),\"\")","v":14},{"$f":"IF($B16=\"\",\"\",INDEX(tScores[Name],MATCH(Standings!$B16,tScores[RANK1],0),1))","v":"Jeremy Pettenger"},{"$f":"IF($B16=\"\",\"\",INDEX(tScores[Game1],MATCH(Standings!$B16,tScores[RANK1],0),1))","v":244},{"$f":"IF($B16=\"\",\"\",INDEX(tScores[Game2],MATCH(Standings!$B16,tScores[RANK1],0),1))","v":191},{"$f":"IF($B16=\"\",\"\",INDEX(tScores[Game3],MATCH(Standings!$B16,tScores[RANK1],0),1))","v":203},{"$f":"IF($B16=\"\",\"\",INDEX(tScores[Game4],MATCH(Standings!$B16,tScores[RANK1],0),1))","v":233},{"$f":"IF($B16=\"\",\"\",INDEX(tScores[Total],MATCH(Standings!$B16,tScores[RANK1],0),1))","v":871.02440000000001}]
[null,{"$f":"IF(ROW(C16)-1<=Bowlers,SMALL(tScores[RANK1],ROW(C16)-1),\"\")","v":15},{"$f":"IF($B17=\"\",\"\",INDEX(tScores[Name],MATCH(Standings!$B17,tScores[RANK1],0),1))","v":"Don Nyenhuis Jr"},{"$f":"IF($B17=\"\",\"\",INDEX(tScores[Game1],MATCH(Standings!$B17,tScores[RANK1],0),1))","v":246},{"$f":"IF($B17=\"\",\"\",INDEX(tScores[Game2],MATCH(Standings!$B17,tScores[RANK1],0),1))","v":257},{"$f":"IF($B17=\"\",\"\",INDEX(tScores[Game3],MATCH(Standings!$B17,tScores[RANK1],0),1))","v":187},{"$f":"IF($B17=\"\",\"\",INDEX(tScores[Game4],MATCH(Standings!$B17,tScores[RANK1],0),1))","v":179},{"$f":"IF($B17=\"\",\"\",INDEX(tScores[Total],MATCH(Standings!$B17,tScores[RANK1],0),1))","v":869.02570000000003}]
[null,{"$f":"IF(ROW(C17)-1<=Bowlers,SMALL(tScores[RANK1],ROW(C17)-1),\"\")","v":16},{"$f":"IF($B18=\"\",\"\",INDEX(tScores[Name],MATCH(Standings!$B18,tScores[RANK1],0),1))","v":"Chad Reiffer"},{"$f":"IF($B18=\"\",\"\",INDEX(tScores[Game1],MATCH(Standings!$B18,tScores[RANK1],0),1))","v":269},{"$f":"IF($B18=\"\",\"\",INDEX(tScores[Game2],MATCH(Standings!$B18,tScores[RANK1],0),1))","v":217},{"$f":"IF($B18=\"\",\"\",INDEX(tScores[Game3],MATCH(Standings!$B18,tScores[RANK1],0),1))","v":189},{"$f":"IF($B18=\"\",\"\",INDEX(tScores[Game4],MATCH(Standings!$B18,tScores[RANK1],0),1))","v":192},{"$f":"IF($B18=\"\",\"\",INDEX(tScores[Total],MATCH(Standings!$B18,tScores[RANK1],0),1))","v":867.02689999999996}]
[null,{"$f":"IF(ROW(C18)-1<=Bowlers,SMALL(tScores[RANK1],ROW(C18)-1),\"\")","v":17},{"$f":"IF($B19=\"\",\"\",INDEX(tScores[Name],MATCH(Standings!$B19,tScores[RANK1],0),1))","v":"Charlie Brown II"},{"$f":"IF($B19=\"\",\"\",INDEX(tScores[Game1],MATCH(Standings!$B19,tScores[RANK1],0),1))","v":232},{"$f":"IF($B19=\"\",\"\",INDEX(tScores[Game2],MATCH(Standings!$B19,tScores[RANK1],0),1))","v":215},{"$f":"IF($B19=\"\",\"\",INDEX(tScores[Game3],MATCH(Standings!$B19,tScores[RANK1],0),1))","v":202},{"$f":"IF($B19=\"\",\"\",INDEX(tScores[Game4],MATCH(Standings!$B19,tScores[RANK1],0),1))","v":214},{"$f":"IF($B19=\"\",\"\",INDEX(tScores[Total],MATCH(Standings!$B19,tScores[RANK1],0),1))","v":863.02319999999997}]
[null,{"$f":"IF(ROW(C19)-1<=Bowlers,SMALL(tScores[RANK1],ROW(C19)-1),\"\")","v":18},{"$f":"IF($B20=\"\",\"\",INDEX(tScores[Name],MATCH(Standings!$B20,tScores[RANK1],0),1))","v":"Jordan Kaufman"},{"$f":"IF($B20=\"\",\"\",INDEX(tScores[Game1],MATCH(Standings!$B20,tScores[RANK1],0),1))","v":247},{"$f":"IF($B20=\"\",\"\",INDEX(tScores[Game2],MATCH(Standings!$B20,tScores[RANK1],0),1))","v":220},{"$f":"IF($B20=\"\",\"\",INDEX(tScores[Game3],MATCH(Standings!$B20,tScores[RANK1],0),1))","v":198},{"$f":"IF($B20=\"\",\"\",INDEX(tScores[Game4],MATCH(Standings!$B20,tScores[RANK1],0),1))","v":190},{"$f":"IF($B20=\"\",\"\",INDEX(tScores[Total],MATCH(Standings!$B20,tScores[RANK1],0),1))","v":855.02470000000005}]
[null,{"$f":"IF(ROW(C20)-1<=Bowlers,SMALL(tScores[RANK1],ROW(C20)-1),\"\")","v":19},{"$f":"IF($B21=\"\",\"\",INDEX(tScores[Name],MATCH(Standings!$B21,tScores[RANK1],0),1))","v":"Tyler Ladwig"},{"$f":"IF($B21=\"\",\"\",INDEX(tScores[Game1],MATCH(Standings!$B21,tScores[RANK1],0),1))","v":215},{"$f":"IF($B21=\"\",\"\",INDEX(tScores[Game2],MATCH(Standings!$B21,tScores[RANK1],0),1))","v":196},{"$f":"IF($B21=\"\",\"\",INDEX(tScores[Game3],MATCH(Standings!$B21,tScores[RANK1],0),1))","v":176},{"$f":"IF($B21=\"\",\"\",INDEX(tScores[Game4],MATCH(Standings!$B21,tScores[RANK1],0),1))","v":257},{"$f":"IF($B21=\"\",\"\",INDEX(tScores[Total],MATCH(Standings!$B21,tScores[RANK1],0),1))","v":844.02570000000003}]
[null,{"$f":"IF(ROW(C21)-1<=Bowlers,SMALL(tScores[RANK1],ROW(C21)-1),\"\")","v":20},{"$f":"IF($B22=\"\",\"\",INDEX(tScores[Name],MATCH(Standings!$B22,tScores[RANK1],0),1))","v":"Derek  Nyenhuis"},{"$f":"IF($B22=\"\",\"\",INDEX(tScores[Game1],MATCH(Standings!$B22,tScores[RANK1],0),1))","v":213},{"$f":"IF($B22=\"\",\"\",INDEX(tScores[Game2],MATCH(Standings!$B22,tScores[RANK1],0),1))","v":208},{"$f":"IF($B22=\"\",\"\",INDEX(tScores[Game3],MATCH(Standings!$B22,tScores[RANK1],0),1))","v":228},{"$f":"IF($B22=\"\",\"\",INDEX(tScores[Game4],MATCH(Standings!$B22,tScores[RANK1],0),1))","v":191},{"$f":"IF($B22=\"\",\"\",INDEX(tScores[Total],MATCH(Standings!$B22,tScores[RANK1],0),1))","v":840.02279999999996}]
[null,{"$f":"IF(ROW(C22)-1<=Bowlers,SMALL(tScores[RANK1],ROW(C22)-1),\"\")","v":21},{"$f":"IF($B23=\"\",\"\",INDEX(tScores[Name],MATCH(Standings!$B23,tScores[RANK1],0),1))","v":"Matt Jelsma"},{"$f":"IF($B23=\"\",\"\",INDEX(tScores[Game1],MATCH(Standings!$B23,tScores[RANK1],0),1))","v":224},{"$f":"IF($B23=\"\",\"\",INDEX(tScores[Game2],MATCH(Standings!$B23,tScores[RANK1],0),1))","v":215},{"$f":"IF($B23=\"\",\"\",INDEX(tScores[Game3],MATCH(Standings!$B23,tScores[RANK1],0),1))","v":192},{"$f":"IF($B23=\"\",\"\",INDEX(tScores[Game4],MATCH(Standings!$B23,tScores[RANK1],0),1))","v":191},{"$f":"IF($B23=\"\",\"\",INDEX(tScores[Total],MATCH(Standings!$B23,tScores[RANK1],0),1))","v":822.02239999999995}]
[null,{"$f":"IF(ROW(C23)-1<=Bowlers,SMALL(tScores[RANK1],ROW(C23)-1),\"\")","v":22},{"$f":"IF($B24=\"\",\"\",INDEX(tScores[Name],MATCH(Standings!$B24,tScores[RANK1],0),1))","v":"Matt DeHaan"},{"$f":"IF($B24=\"\",\"\",INDEX(tScores[Game1],MATCH(Standings!$B24,tScores[RANK1],0),1))","v":194},{"$f":"IF($B24=\"\",\"\",INDEX(tScores[Game2],MATCH(Standings!$B24,tScores[RANK1],0),1))","v":217},{"$f":"IF($B24=\"\",\"\",INDEX(tScores[Game3],MATCH(Standings!$B24,tScores[RANK1],0),1))","v":175},{"$f":"IF($B24=\"\",\"\",INDEX(tScores[Game4],MATCH(Standings!$B24,tScores[RANK1],0),1))","v":225},{"$f":"IF($B24=\"\",\"\",INDEX(tScores[Total],MATCH(Standings!$B24,tScores[RANK1],0),1))","v":811.02250000000004}]
[null,{"$f":"IF(ROW(C24)-1<=Bowlers,SMALL(tScores[RANK1],ROW(C24)-1),\"\")","v":23},{"$f":"IF($B25=\"\",\"\",INDEX(tScores[Name],MATCH(Standings!$B25,tScores[RANK1],0),1))","v":"Dan Bailey"},{"$f":"IF($B25=\"\",\"\",INDEX(tScores[Game1],MATCH(Standings!$B25,tScores[RANK1],0),1))","v":197},{"$f":"IF($B25=\"\",\"\",INDEX(tScores[Game2],MATCH(Standings!$B25,tScores[RANK1],0),1))","v":215},{"$f":"IF($B25=\"\",\"\",INDEX(tScores[Game3],MATCH(Standings!$B25,tScores[RANK1],0),1))","v":179},{"$f":"IF($B25=\"\",\"\",INDEX(tScores[Game4],MATCH(Standings!$B25,tScores[RANK1],0),1))","v":210},{"$f":"IF($B25=\"\",\"\",INDEX(tScores[Total],MATCH(Standings!$B25,tScores[RANK1],0),1))","v":801.02149999999995}]
[null,{"$f":"IF(ROW(C25)-1<=Bowlers,SMALL(tScores[RANK1],ROW(C25)-1),\"\")","v":24},{"$f":"IF($B26=\"\",\"\",INDEX(tScores[Name],MATCH(Standings!$B26,tScores[RANK1],0),1))","v":"Tom Morgan"},{"$f":"IF($B26=\"\",\"\",INDEX(tScores[Game1],MATCH(Standings!$B26,tScores[RANK1],0),1))","v":191},{"$f":"IF($B26=\"\",\"\",INDEX(tScores[Game2],MATCH(Standings!$B26,tScores[RANK1],0),1))","v":191},{"$f":"IF($B26=\"\",\"\",INDEX(tScores[Game3],MATCH(Standings!$B26,tScores[RANK1],0),1))","v":202},{"$f":"IF($B26=\"\",\"\",INDEX(tScores[Game4],MATCH(Standings!$B26,tScores[RANK1],0),1))","v":213},{"$f":"IF($B26=\"\",\"\",INDEX(tScores[Total],MATCH(Standings!$B26,tScores[RANK1],0),1))","v":797.0213}]
[null,{"$f":"IF(ROW(C26)-1<=Bowlers,SMALL(tScores[RANK1],ROW(C26)-1),\"\")","v":25},{"$f":"IF($B27=\"\",\"\",INDEX(tScores[Name],MATCH(Standings!$B27,tScores[RANK1],0),1))","v":"Mike Lipzinski"},{"$f":"IF($B27=\"\",\"\",INDEX(tScores[Game1],MATCH(Standings!$B27,tScores[RANK1],0),1))","v":172},{"$f":"IF($B27=\"\",\"\",INDEX(tScores[Game2],MATCH(Standings!$B27,tScores[RANK1],0),1))","v":223},{"$f":"IF($B27=\"\",\"\",INDEX(tScores[Game3],MATCH(Standings!$B27,tScores[RANK1],0),1))","v":184},{"$f":"IF($B27=\"\",\"\",INDEX(tScores[Game4],MATCH(Standings!$B27,tScores[RANK1],0),1))","v":216},{"$f":"IF($B27=\"\",\"\",INDEX(tScores[Total],MATCH(Standings!$B27,tScores[RANK1],0),1))","v":795.02229999999997}]
[null,{"$f":"IF(ROW(C27)-1<=Bowlers,SMALL(tScores[RANK1],ROW(C27)-1),\"\")","v":26},{"$f":"IF($B28=\"\",\"\",INDEX(tScores[Name],MATCH(Standings!$B28,tScores[RANK1],0),1))","v":"Brad Nawrocki"},{"$f":"IF($B28=\"\",\"\",INDEX(tScores[Game1],MATCH(Standings!$B28,tScores[RANK1],0),1))","v":185},{"$f":"IF($B28=\"\",\"\",INDEX(tScores[Game2],MATCH(Standings!$B28,tScores[RANK1],0),1))","v":200},{"$f":"IF($B28=\"\",\"\",INDEX(tScores[Game3],MATCH(Standings!$B28,tScores[RANK1],0),1))","v":158},{"$f":"IF($B28=\"\",\"\",INDEX(tScores[Game4],MATCH(Standings!$B28,tScores[RANK1],0),1))","v":236},{"$f":"IF($B28=\"\",\"\",INDEX(tScores[Total],MATCH(Standings!$B28,tScores[RANK1],0),1))","v":779.02359999999999}]
[null,{"$f":"IF(ROW(C28)-1<=Bowlers,SMALL(tScores[RANK1],ROW(C28)-1),\"\")","v":27},{"$f":"IF($B29=\"\",\"\",INDEX(tScores[Name],MATCH(Standings!$B29,tScores[RANK1],0),1))","v":"Bill Orlikowski"},{"$f":"IF($B29=\"\",\"\",INDEX(tScores[Game1],MATCH(Standings!$B29,tScores[RANK1],0),1))","v":246},{"$f":"IF($B29=\"\",\"\",INDEX(tScores[Game2],MATCH(Standings!$B29,tScores[RANK1],0),1))","v":169},{"$f":"IF($B29=\"\",\"\",INDEX(tScores[Game3],MATCH(Standings!$B29,tScores[RANK1],0),1))","v":199},{"$f":"IF($B29=\"\",\"\",INDEX(tScores[Game4],MATCH(Standings!$B29,tScores[RANK1],0),1))","v":163},{"$f":"IF($B29=\"\",\"\",INDEX(tScores[Total],MATCH(Standings!$B29,tScores[RANK1],0),1))","v":777.02459999999996}]
[null,{"$f":"IF(ROW(C29)-1<=Bowlers,SMALL(tScores[RANK1],ROW(C29)-1),\"\")","v":28},{"$f":"IF($B30=\"\",\"\",INDEX(tScores[Name],MATCH(Standings!$B30,tScores[RANK1],0),1))","v":"Eric Bottrall"},{"$f":"IF($B30=\"\",\"\",INDEX(tScores[Game1],MATCH(Standings!$B30,tScores[RANK1],0),1))","v":211},{"$f":"IF($B30=\"\",\"\",INDEX(tScores[Game2],MATCH(Standings!$B30,tScores[RANK1],0),1))","v":150},{"$f":"IF($B30=\"\",\"\",INDEX(tScores[Game3],MATCH(Standings!$B30,tScores[RANK1],0),1))","v":204},{"$f":"IF($B30=\"\",\"\",INDEX(tScores[Game4],MATCH(Standings!$B30,tScores[RANK1],0),1))","v":210},{"$f":"IF($B30=\"\",\"\",INDEX(tScores[Total],MATCH(Standings!$B30,tScores[RANK1],0),1))","v":775.02110000000005}]
[null,{"$f":"IF(ROW(C30)-1<=Bowlers,SMALL(tScores[RANK1],ROW(C30)-1),\"\")","v":29},{"$f":"IF($B31=\"\",\"\",INDEX(tScores[Name],MATCH(Standings!$B31,tScores[RANK1],0),1))","v":"David Napier"},{"$f":"IF($B31=\"\",\"\",INDEX(tScores[Game1],MATCH(Standings!$B31,tScores[RANK1],0),1))","v":203},{"$f":"IF($B31=\"\",\"\",INDEX(tScores[Game2],MATCH(Standings!$B31,tScores[RANK1],0),1))","v":180},{"$f":"IF($B31=\"\",\"\",INDEX(tScores[Game3],MATCH(Standings!$B31,tScores[RANK1],0),1))","v":211},{"$f":"IF($B31=\"\",\"\",INDEX(tScores[Game4],MATCH(Standings!$B31,tScores[RANK1],0),1))","v":175},{"$f":"IF($B31=\"\",\"\",INDEX(tScores[Total],MATCH(Standings!$B31,tScores[RANK1],0),1))","v":769.02110000000005}]
[null,{"$f":"IF(ROW(C31)-1<=Bowlers,SMALL(tScores[RANK1],ROW(C31)-1),\"\")","v":30},{"$f":"IF($B32=\"\",\"\",INDEX(tScores[Name],MATCH(Standings!$B32,tScores[RANK1],0),1))","v":"Tim Huizinga"},{"$f":"IF($B32=\"\",\"\",INDEX(tScores[Game1],MATCH(Standings!$B32,tScores[RANK1],0),1))","v":160},{"$f":"IF($B32=\"\",\"\",INDEX(tScores[Game2],MATCH(Standings!$B32,tScores[RANK1],0),1))","v":193},{"$f":"IF($B32=\"\",\"\",INDEX(tScores[Game3],MATCH(Standings!$B32,tScores[RANK1],0),1))","v":180},{"$f":"IF($B32=\"\",\"\",INDEX(tScores[Game4],MATCH(Standings!$B32,tScores[RANK1],0),1))","v":235},{"$f":"IF($B32=\"\",\"\",INDEX(tScores[Total],MATCH(Standings!$B32,tScores[RANK1],0),1))","v":768.02350000000001}]
[null,{"$f":"IF(ROW(C32)-1<=Bowlers,SMALL(tScores[RANK1],ROW(C32)-1),\"\")","v":31},{"$f":"IF($B33=\"\",\"\",INDEX(tScores[Name],MATCH(Standings!$B33,tScores[RANK1],0),1))","v":"Dale Rockewell"},{"$f":"IF($B33=\"\",\"\",INDEX(tScores[Game1],MATCH(Standings!$B33,tScores[RANK1],0),1))","v":168},{"$f":"IF($B33=\"\",\"\",INDEX(tScores[Game2],MATCH(Standings!$B33,tScores[RANK1],0),1))","v":181},{"$f":"IF($B33=\"\",\"\",INDEX(tScores[Game3],MATCH(Standings!$B33,tScores[RANK1],0),1))","v":204},{"$f":"IF($B33=\"\",\"\",INDEX(tScores[Game4],MATCH(Standings!$B33,tScores[RANK1],0),1))","v":211},{"$f":"IF($B33=\"\",\"\",INDEX(tScores[Total],MATCH(Standings!$B33,tScores[RANK1],0),1))","v":764.02110000000005}]
[null,{"$f":"IF(ROW(C33)-1<=Bowlers,SMALL(tScores[RANK1],ROW(C33)-1),\"\")","v":32},{"$f":"IF($B34=\"\",\"\",INDEX(tScores[Name],MATCH(Standings!$B34,tScores[RANK1],0),1))","v":"Mel Atkins"},{"$f":"IF($B34=\"\",\"\",INDEX(tScores[Game1],MATCH(Standings!$B34,tScores[RANK1],0),1))","v":190},{"$f":"IF($B34=\"\",\"\",INDEX(tScores[Game2],MATCH(Standings!$B34,tScores[RANK1],0),1))","v":226},{"$f":"IF($B34=\"\",\"\",INDEX(tScores[Game3],MATCH(Standings!$B34,tScores[RANK1],0),1))","v":147},{"$f":"IF($B34=\"\",\"\",INDEX(tScores[Game4],MATCH(Standings!$B34,tScores[RANK1],0),1))","v":193},{"$f":"IF($B34=\"\",\"\",INDEX(tScores[Total],MATCH(Standings!$B34,tScores[RANK1],0),1))","v":756.02260000000001}]
[null,{"$f":"IF(ROW(C34)-1<=Bowlers,SMALL(tScores[RANK1],ROW(C34)-1),\"\")","v":33},{"$f":"IF($B35=\"\",\"\",INDEX(tScores[Name],MATCH(Standings!$B35,tScores[RANK1],0),1))","v":"John Powney"},{"$f":"IF($B35=\"\",\"\",INDEX(tScores[Game1],MATCH(Standings!$B35,tScores[RANK1],0),1))","v":196},{"$f":"IF($B35=\"\",\"\",INDEX(tScores[Game2],MATCH(Standings!$B35,tScores[RANK1],0),1))","v":153},{"$f":"IF($B35=\"\",\"\",INDEX(tScores[Game3],MATCH(Standings!$B35,tScores[RANK1],0),1))","v":140},{"$f":"IF($B35=\"\",\"\",INDEX(tScores[Game4],MATCH(Standings!$B35,tScores[RANK1],0),1))","v":203},{"$f":"IF($B35=\"\",\"\",INDEX(tScores[Total],MATCH(Standings!$B35,tScores[RANK1],0),1))","v":692.02030000000002}]
[null,{"$f":"IF(ROW(C35)-1<=Bowlers,SMALL(tScores[RANK1],ROW(C35)-1),\"\")","v":""},{"$f":"IF($B36=\"\",\"\",INDEX(tScores[Name],MATCH(Standings!$B36,tScores[RANK1],0),1))","v":""},{"$f":"IF($B36=\"\",\"\",INDEX(tScores[Game1],MATCH(Standings!$B36,tScores[RANK1],0),1))","v":""},{"$f":"IF($B36=\"\",\"\",INDEX(tScores[Game2],MATCH(Standings!$B36,tScores[RANK1],0),1))","v":""},{"$f":"IF($B36=\"\",\"\",INDEX(tScores[Game3],MATCH(Standings!$B36,tScores[RANK1],0),1))","v":""},{"$f":"IF($B36=\"\",\"\",INDEX(tScores[Game4],MATCH(Standings!$B36,tScores[RANK1],0),1))","v":""},{"$f":"IF($B36=\"\",\"\",INDEX(tScores[Total],MATCH(Standings!$B36,tScores[RANK1],0),1))","v":""}]
[null,{"$f":"IF(ROW(C36)-1<=Bowlers,SMALL(tScores[RANK1],ROW(C36)-1),\"\")","v":""},{"$f":"IF($B37=\"\",\"\",INDEX(tScores[Name],MATCH(Standings!$B37,tScores[RANK1],0),1))","v":""},{"$f":"IF($B37=\"\",\"\",INDEX(tScores[Game1],MATCH(Standings!$B37,tScores[RANK1],0),1))","v":""},{"$f":"IF($B37=\"\",\"\",INDEX(tScores[Game2],MATCH(Standings!$B37,tScores[RANK1],0),1))","v":""},{"$f":"IF($B37=\"\",\"\",INDEX(tScores[Game3],MATCH(Standings!$B37,tScores[RANK1],0),1))","v":""},{"$f":"IF($B37=\"\",\"\",INDEX(tScores[Game4],MATCH(Standings!$B37,tScores[RANK1],0),1))","v":""},{"$f":"IF($B37=\"\",\"\",INDEX(tScores[Total],MATCH(Standings!$B37,tScores[RANK1],0),1))","v":""}]
[null,{"$f":"IF(ROW(C37)-1<=Bowlers,SMALL(tScores[RANK1],ROW(C37)-1),\"\")","v":""},{"$f":"IF($B38=\"\",\"\",INDEX(tScores[Name],MATCH(Standings!$B38,tScores[RANK1],0),1))","v":""},{"$f":"IF($B38=\"\",\"\",INDEX(tScores[Game1],MATCH(Standings!$B38,tScores[RANK1],0),1))","v":""},{"$f":"IF($B38=\"\",\"\",INDEX(tScores[Game2],MATCH(Standings!$B38,tScores[RANK1],0),1))","v":""},{"$f":"IF($B38=\"\",\"\",INDEX(tScores[Game3],MATCH(Standings!$B38,tScores[RANK1],0),1))","v":""},{"$f":"IF($B38=\"\",\"\",INDEX(tScores[Game4],MATCH(Standings!$B38,tScores[RANK1],0),1))","v":""},{"$f":"IF($B38=\"\",\"\",INDEX(tScores[Total],MATCH(Standings!$B38,tScores[RANK1],0),1))","v":""}]
[null,{"$f":"IF(ROW(C38)-1<=Bowlers,SMALL(tScores[RANK1],ROW(C38)-1),\"\")","v":""},{"$f":"IF($B39=\"\",\"\",INDEX(tScores[Name],MATCH(Standings!$B39,tScores[RANK1],0),1))","v":""},{"$f":"IF($B39=\"\",\"\",INDEX(tScores[Game1],MATCH(Standings!$B39,tScores[RANK1],0),1))","v":""},{"$f":"IF($B39=\"\",\"\",INDEX(tScores[Game2],MATCH(Standings!$B39,tScores[RANK1],0),1))","v":""},{"$f":"IF($B39=\"\",\"\",INDEX(tScores[Game3],MATCH(Standings!$B39,tScores[RANK1],0),1))","v":""},{"$f":"IF($B39=\"\",\"\",INDEX(tScores[Game4],MATCH(Standings!$B39,tScores[RANK1],0),1))","v":""},{"$f":"IF($B39=\"\",\"\",INDEX(tScores[Total],MATCH(Standings!$B39,tScores[RANK1],0),1))","v":""}]
[null,{"$f":"IF(ROW(C39)-1<=Bowlers,SMALL(tScores[RANK1],ROW(C39)-1),\"\")","v":""},{"$f":"IF($B40=\"\",\"\",INDEX(tScores[Name],MATCH(Standings!$B40,tScores[RANK1],0),1))","v":""},{"$f":"IF($B40=\"\",\"\",INDEX(tScores[Game1],MATCH(Standings!$B40,tScores[RANK1],0),1))","v":""},{"$f":"IF($B40=\"\",\"\",INDEX(tScores[Game2],MATCH(Standings!$B40,tScores[RANK1],0),1))","v":""},{"$f":"IF($B40=\"\",\"\",INDEX(tScores[Game3],MATCH(Standings!$B40,tScores[RANK1],0),1))","v":""},{"$f":"IF($B40=\"\",\"\",INDEX(tScores[Game4],MATCH(Standings!$B40,tScores[RANK1],0),1))","v":""},{"$f":"IF($B40=\"\",\"\",INDEX(tScores[Total],MATCH(Standings!$B40,tScores[RANK1],0),1))","v":""}]
[null,{"$f":"IF(ROW(C40)-1<=Bowlers,SMALL(tScores[RANK1],ROW(C40)-1),\"\")","v":""},{"$f":"IF($B41=\"\",\"\",INDEX(tScores[Name],MATCH(Standings!$B41,tScores[RANK1],0),1))","v":""},{"$f":"IF($B41=\"\",\"\",INDEX(tScores[Game1],MATCH(Standings!$B41,tScores[RANK1],0),1))","v":""},{"$f":"IF($B41=\"\",\"\",INDEX(tScores[Game2],MATCH(Standings!$B41,tScores[RANK1],0),1))","v":""},{"$f":"IF($B41=\"\",\"\",INDEX(tScores[Game3],MATCH(Standings!$B41,tScores[RANK1],0),1))","v":""},{"$f":"IF($B41=\"\",\"\",INDEX(tScores[Game4],MATCH(Standings!$B41,tScores[RANK1],0),1))","v":""},{"$f":"IF($B41=\"\",\"\",INDEX(tScores[Total],MATCH(Standings!$B41,tScores[RANK1],0),1))","v":""}]
[null,{"$f":"IF(ROW(C41)-1<=Bowlers,SMALL(tScores[RANK1],ROW(C41)-1),\"\")","v":""},{"$f":"IF($B42=\"\",\"\",INDEX(tScores[Name],MATCH(Standings!$B42,tScores[RANK1],0),1))","v":""},{"$f":"IF($B42=\"\",\"\",INDEX(tScores[Game1],MATCH(Standings!$B42,tScores[RANK1],0),1))","v":""},{"$f":"IF($B42=\"\",\"\",INDEX(tScores[Game2],MATCH(Standings!$B42,tScores[RANK1],0),1))","v":""},{"$f":"IF($B42=\"\",\"\",INDEX(tScores[Game3],MATCH(Standings!$B42,tScores[RANK1],0),1))","v":""},{"$f":"IF($B42=\"\",\"\",INDEX(tScores[Game4],MATCH(Standings!$B42,tScores[RANK1],0),1))","v":""},{"$f":"IF($B42=\"\",\"\",INDEX(tScores[Total],MATCH(Standings!$B42,tScores[RANK1],0),1))","v":""}]
[null,{"$f":"IF(ROW(C42)-1<=Bowlers,SMALL(tScores[RANK1],ROW(C42)-1),\"\")","v":""},{"$f":"IF($B43=\"\",\"\",INDEX(tScores[Name],MATCH(Standings!$B43,tScores[RANK1],0),1))","v":""},{"$f":"IF($B43=\"\",\"\",INDEX(tScores[Game1],MATCH(Standings!$B43,tScores[RANK1],0),1))","v":""},{"$f":"IF($B43=\"\",\"\",INDEX(tScores[Game2],MATCH(Standings!$B43,tScores[RANK1],0),1))","v":""},{"$f":"IF($B43=\"\",\"\",INDEX(tScores[Game3],MATCH(Standings!$B43,tScores[RANK1],0),1))","v":""},{"$f":"IF($B43=\"\",\"\",INDEX(tScores[Game4],MATCH(Standings!$B43,tScores[RANK1],0),1))","v":""},{"$f":"IF($B43=\"\",\"\",INDEX(tScores[Total],MATCH(Standings!$B43,tScores[RANK1],0),1))","v":""}]
[null,{"$f":"IF(ROW(C43)-1<=Bowlers,SMALL(tScores[RANK1],ROW(C43)-1),\"\")","v":""},{"$f":"IF($B44=\"\",\"\",INDEX(tScores[Name],MATCH(Standings!$B44,tScores[RANK1],0),1))","v":""},{"$f":"IF($B44=\"\",\"\",INDEX(tScores[Game1],MATCH(Standings!$B44,tScores[RANK1],0),1))","v":""},{"$f":"IF($B44=\"\",\"\",INDEX(tScores[Game2],MATCH(Standings!$B44,tScores[RANK1],0),1))","v":""},{"$f":"IF($B44=\"\",\"\",INDEX(tScores[Game3],MATCH(Standings!$B44,tScores[RANK1],0),1))","v":""},{"$f":"IF($B44=\"\",\"\",INDEX(tScores[Game4],MATCH(Standings!$B44,tScores[RANK1],0),1))","v":""},{"$f":"IF($B44=\"\",\"\",INDEX(tScores[Total],MATCH(Standings!$B44,tScores[RANK1],0),1))","v":""}]
[null,{"$f":"IF(ROW(C44)-1<=Bowlers,SMALL(tScores[RANK1],ROW(C44)-1),\"\")","v":""},{"$f":"IF($B45=\"\",\"\",INDEX(tScores[Name],MATCH(Standings!$B45,tScores[RANK1],0),1))","v":""},{"$f":"IF($B45=\"\",\"\",INDEX(tScores[Game1],MATCH(Standings!$B45,tScores[RANK1],0),1))","v":""},{"$f":"IF($B45=\"\",\"\",INDEX(tScores[Game2],MATCH(Standings!$B45,tScores[RANK1],0),1))","v":""},{"$f":"IF($B45=\"\",\"\",INDEX(tScores[Game3],MATCH(Standings!$B45,tScores[RANK1],0),1))","v":""},{"$f":"IF($B45=\"\",\"\",INDEX(tScores[Game4],MATCH(Standings!$B45,tScores[RANK1],0),1))","v":""},{"$f":"IF($B45=\"\",\"\",INDEX(tScores[Total],MATCH(Standings!$B45,tScores[RANK1],0),1))","v":""}]
[null,{"$f":"IF(ROW(C45)-1<=Bowlers,SMALL(tScores[RANK1],ROW(C45)-1),\"\")","v":""},{"$f":"IF($B46=\"\",\"\",INDEX(tScores[Name],MATCH(Standings!$B46,tScores[RANK1],0),1))","v":""},{"$f":"IF($B46=\"\",\"\",INDEX(tScores[Game1],MATCH(Standings!$B46,tScores[RANK1],0),1))","v":""},{"$f":"IF($B46=\"\",\"\",INDEX(tScores[Game2],MATCH(Standings!$B46,tScores[RANK1],0),1))","v":""},{"$f":"IF($B46=\"\",\"\",INDEX(tScores[Game3],MATCH(Standings!$B46,tScores[RANK1],0),1))","v":""},{"$f":"IF($B46=\"\",\"\",INDEX(tScores[Game4],MATCH(Standings!$B46,tScores[RANK1],0),1))","v":""},{"$f":"IF($B46=\"\",\"\",INDEX(tScores[Total],MATCH(Standings!$B46,tScores[RANK1],0),1))","v":""}]
[null,{"$f":"IF(ROW(C46)-1<=Bowlers,SMALL(tScores[RANK1],ROW(C46)-1),\"\")","v":""},{"$f":"IF($B47=\"\",\"\",INDEX(tScores[Name],MATCH(Standings!$B47,tScores[RANK1],0),1))","v":""},{"$f":"IF($B47=\"\",\"\",INDEX(tScores[Game1],MATCH(Standings!$B47,tScores[RANK1],0),1))","v":""},{"$f":"IF($B47=\"\",\"\",INDEX(tScores[Game2],MATCH(Standings!$B47,tScores[RANK1],0),1))","v":""},{"$f":"IF($B47=\"\",\"\",INDEX(tScores[Game3],MATCH(Standings!$B47,tScores[RANK1],0),1))","v":""},{"$f":"IF($B47=\"\",\"\",INDEX(tScores[Game4],MATCH(Standings!$B47,tScores[RANK1],0),1))","v":""},{"$f":"IF($B47=\"\",\"\",INDEX(tScores[Total],MATCH(Standings!$B47,tScores[RANK1],0),1))","v":""}]
[null,{"$f":"IF(ROW(C47)-1<=Bowlers,SMALL(tScores[RANK1],ROW(C47)-1),\"\")","v":""},{"$f":"IF($B48=\"\",\"\",INDEX(tScores[Name],MATCH(Standings!$B48,tScores[RANK1],0),1))","v":""},{"$f":"IF($B48=\"\",\"\",INDEX(tScores[Game1],MATCH(Standings!$B48,tScores[RANK1],0),1))","v":""},{"$f":"IF($B48=\"\",\"\",INDEX(tScores[Game2],MATCH(Standings!$B48,tScores[RANK1],0),1))","v":""},{"$f":"IF($B48=\"\",\"\",INDEX(tScores[Game3],MATCH(Standings!$B48,tScores[RANK1],0),1))","v":""},{"$f":"IF($B48=\"\",\"\",INDEX(tScores[Game4],MATCH(Standings!$B48,tScores[RANK1],0),1))","v":""},{"$f":"IF($B48=\"\",\"\",INDEX(tScores[Total],MATCH(Standings!$B48,tScores[RANK1],0),1))","v":""}]
[null,{"$f":"IF(ROW(C48)-1<=Bowlers,SMALL(tScores[RANK1],ROW(C48)-1),\"\")","v":""},{"$f":"IF($B49=\"\",\"\",INDEX(tScores[Name],MATCH(Standings!$B49,tScores[RANK1],0),1))","v":""},{"$f":"IF($B49=\"\",\"\",INDEX(tScores[Game1],MATCH(Standings!$B49,tScores[RANK1],0),1))","v":""},{"$f":"IF($B49=\"\",\"\",INDEX(tScores[Game2],MATCH(Standings!$B49,tScores[RANK1],0),1))","v":""},{"$f":"IF($B49=\"\",\"\",INDEX(tScores[Game3],MATCH(Standings!$B49,tScores[RANK1],0),1))","v":""},{"$f":"IF($B49=\"\",\"\",INDEX(tScores[Game4],MATCH(Standings!$B49,tScores[RANK1],0),1))","v":""},{"$f":"IF($B49=\"\",\"\",INDEX(tScores[Total],MATCH(Standings!$B49,tScores[RANK1],0),1))","v":""}]
[null,{"$f":"IF(ROW(C49)-1<=Bowlers,SMALL(tScores[RANK1],ROW(C49)-1),\"\")","v":""},{"$f":"IF($B50=\"\",\"\",INDEX(tScores[Name],MATCH(Standings!$B50,tScores[RANK1],0),1))","v":""},{"$f":"IF($B50=\"\",\"\",INDEX(tScores[Game1],MATCH(Standings!$B50,tScores[RANK1],0),1))","v":""},{"$f":"IF($B50=\"\",\"\",INDEX(tScores[Game2],MATCH(Standings!$B50,tScores[RANK1],0),1))","v":""},{"$f":"IF($B50=\"\",\"\",INDEX(tScores[Game3],MATCH(Standings!$B50,tScores[RANK1],0),1))","v":""},{"$f":"IF($B50=\"\",\"\",INDEX(tScores[Game4],MATCH(Standings!$B50,tScores[RANK1],0),1))","v":""},{"$f":"IF($B50=\"\",\"\",INDEX(tScores[Total],MATCH(Standings!$B50,tScores[RANK1],0),1))","v":""}]
[null,{"$f":"IF(ROW(C50)-1<=Bowlers,SMALL(tScores[RANK1],ROW(C50)-1),\"\")","v":""}]
[null,{"$f":"IF(ROW(C51)-1<=Bowlers,SMALL(tScores[RANK1],ROW(C51)-1),\"\")","v":""}]
[null,{"$f":"IF(ROW(C52)-1<=Bowlers,SMALL(tScores[RANK1],ROW(C52)-1),\"\")","v":""}]
[null,{"$f":"IF(ROW(C53)-1<=Bowlers,SMALL(tScores[RANK1],ROW(C53)-1),\"\")","v":""}]
[null,{"$f":"IF(ROW(C54)-1<=Bowlers,SMALL(tScores[RANK1],ROW(C54)-1),\"\")","v":""}]
[null,{"$f":"IF(ROW(C55)-1<=Bowlers,SMALL(tScores[RANK1],ROW(C55)-1),\"\")","v":""}]
[null,{"$f":"IF(ROW(C56)-1<=Bowlers,SMALL(tScores[RANK1],ROW(C56)-1),\"\")","v":""}]
[null,{"$f":"IF(ROW(C57)-1<=Bowlers,SMALL(tScores[RANK1],ROW(C57)-1),\"\")","v":""}]
[null,{"$f":"IF(ROW(C58)-1<=Bowlers,SMALL(tScores[RANK1],ROW(C58)-1),\"\")","v":""}]
[null,{"$f":"IF(ROW(C59)-1<=Bowlers,SMALL(tScores[RANK1],ROW(C59)-1),\"\")","v":""}]
[null,{"$f":"IF(ROW(C60)-1<=Bowlers,SMALL(tScores[RANK1],ROW(C60)-1),\"\")","v":""}]
[null,{"$f":"IF(ROW(C61)-1<=Bowlers,SMALL(tScores[RANK1],ROW(C61)-1),\"\")","v":""}]
[null,{"$f":"IF(ROW(C62)-1<=Bowlers,SMALL(tScores[RANK1],ROW(C62)-1),\"\")","v":""}]
[null,{"$f":"IF(ROW(C63)-1<=Bowlers,SMALL(tScores[RANK1],ROW(C63)-1),\"\")","v":""}]
[null,{"$f":"IF(ROW(C64)-1<=Bowlers,SMALL(tScores[RANK1],ROW(C64)-1),\"\")","v":""}]

{"sheet":"ScoreSheets","index":3,"n_rows":281,"n_cols":7,"rows_kept":281,"cut":false,"hidden":false,"merged":[[11,0,11,1],[15,0,15,1],[16,0,16,1],[17,0,17,1],[21,0,21,1],[22,0,22,1],[0,0,0,6],[3,0,3,1],[4,0,4,1],[5,0,5,1],[9,0,9,1],[10,0,10,1],[35,0,35,1],[38,0,38,1],[39,0,39,1],[40,0,40,1],[44,0,44,1],[45,0,45,1],[23,0,23,1],[27,0,27,1],[28,0,28,1],[29,0,29,1],[33,0,33,1],[34,0,34,1],[70,0,70,1],[58,0,58,1],[62,0,62,1],[63,0,63,1],[64,0,64,1],[68,0,68,1],[69,0,69,1],[46,0,46,1],[50,0,50,1],[51,0,51,1],[52,0,52,1],[56,0,56,1],[57,0,57,1],[93,0,93,1],[97,0,97,1],[98,0,98,1],[99,0,99,1],[103,0,103,1],[104,0,104,1],[81,0,81,1],[85,0,85,1],[86,0,86,1],[87,0,87,1],[91,0,91,1],[92,0,92,1],[116,0,116,1],[120,0,120,1],[121,0,121,1],[122,0,122,1],[126,0,126,1],[127,0,127,1],[105,0,105,1],[108,0,108,1],[109,0,109,1],[110,0,110,1],[114,0,114,1],[115,0,115,1],[140,0,140,1],[143,0,143,1],[144,0,144,1],[145,0,145,1],[149,0,149,1],[150,0,150,1],[128,0,128,1],[132,0,132,1],[133,0,133,1],[134,0,134,1],[138,0,138,1],[139,0,139,1],[163,0,163,1],[167,0,167,1],[168,0,168,1],[169,0,169,1],[173,0,173,1],[174,0,174,1],[151,0,151,1],[155,0,155,1],[156,0,156,1],[157,0,157,1],[161,0,161,1],[162,0,162,1],[186,0,186,1],[190,0,190,1],[191,0,191,1],[192,0,192,1],[196,0,196,1],[197,0,197,1],[175,0,175,1],[178,0,178,1],[179,0,179,1],[180,0,180,1],[184,0,184,1],[185,0,185,1],[210,0,210,1],[213,0,213,1],[214,0,214,1],[215,0,215,1],[219,0,219,1],[220,0,220,1],[198,0,198,1],[202,0,202,1],[203,0,203,1],[204,0,204,1],[208,0,208,1],[209,0,209,1],[233,0,233,1],[237,0,237,1],[238,0,238,1],[239,0,239,1],[243,0,243,1],[244,0,244,1],[221,0,221,1],[225,0,225,1],[226,0,226,1],[227,0,227,1],[231,0,231,1],[232,0,232,1],[280,0,280,1],[73,0,73,1],[74,0,74,1],[75,0,75,1],[79,0,79,1],[80,0,80,1],[268,0,268,1],[272,0,272,1],[273,0,273,1],[274,0,274,1],[278,0,278,1],[279,0,279,1],[256,0,256,1],[260,0,260,1],[261,0,261,1],[262,0,262,1],[266,0,266,1],[267,0,267,1],[245,0,245,1],[248,0,248,1],[249,0,249,1],[250,0,250,1],[254,0,254,1],[255,0,255,1]]}
[]
["SPOT/LANE","A",{"$f":"sLane","v":3},{"$f":"IF(C2+4>eLane,C2-(eLane-sLane)+3,C2+4)","v":7},{"$f":"IF(D2+4>eLane,D2-(eLane-sLane)+3,D2+4)","v":11},{"$f":"IF(E2+4>eLane,E2-(eLane-sLane)+3,E2+4)","v":15}]
[null,null,"GAME 1","GAME 2","GAME 3 ","GAME 4","TOTAL"]
[{"$f":"IFERROR(INDEX(tScores[Name],MATCH(C2&\"-\"&B2,tScores[Starting],0),1),\"\")","v":"Steve Marcus"}]
["Totals"]
["+/-"]
[]
["SPOT/LANE","B",{"$f":"C2","v":3},{"$f":"D2","v":7},11,15]
[null,null,"GAME 1","GAME 2","GAME 3 ","GAME 4","TOTAL"]
[{"$f":"IFERROR(INDEX(tScores[Name],MATCH(C8&\"-\"&B8,tScores[Starting],0),1),\"\")","v":"Don Veltman"}]
["Totals"]
["+/-"]
[]
["SPOT/LANE","C",{"$f":"C2","v":3},{"$f":"D2","v":7},11,15]
[null,null,"GAME 1","GAME 2","GAME 3 ","GAME 4","TOTAL"]
[{"$f":"IFERROR(INDEX(tScores[Name],MATCH(C14&\"-\"&B14,tScores[Starting],0),1),\"\")","v":"Eric Bottrall"}]
["Totals"]
["+/-"]
[]
["SPOT/LANE","D",{"$f":"MAX($C$2:C19)+1","v":4},{"$f":"D2+1","v":8},12,16]
[null,null,"GAME 1","GAME 2","GAME 3 ","GAME 4","TOTAL"]
[{"$f":"IFERROR(INDEX(tScores[Name],MATCH(C20&\"-\"&B20,tScores[Starting],0),1),\"\")","v":"David Napier"}]
["Totals"]
["+/-"]
[]
["SPOT/LANE","E",{"$f":"C20","v":4},{"$f":"D20","v":8},12,16]
[null,null,"GAME 1","GAME 2","GAME 3 ","GAME 4","TOTAL"]
[{"$f":"IFERROR(INDEX(tScores[Name],MATCH(C26&\"-\"&B26,tScores[Starting],0),1),\"\")","v":"Dale Rockewell"}]
["Totals"]
["+/-"]
[]
["SPOT/LANE","F",{"$f":"MAX($C$2:C14)+1","v":4},{"$f":"D20","v":8},12,16]
[null,null,"GAME 1","GAME 2","GAME 3 ","GAME 4","TOTAL"]
[{"$f":"IFERROR(INDEX(tScores[Name],MATCH(C32&\"-\"&B32,tScores[Starting],0),1),\"\")","v":""}]
["Totals"]
["+/-"]
["SPOT/LANE","A",{"$f":"MAX($C$2:C36)+1","v":5},{"$f":"IF(C37+4>eLane,C37-(eLane-sLane)+3,C37+4)","v":9},{"$f":"IF(D37+4>eLane,D37-(eLane-sLane)+3,D37+4)","v":13},{"$f":"IF(E37+4>eLane,E37-(eLane-sLane)+3,E37+4)","v":17}]
[null,null,"GAME 1","GAME 2","GAME 3 ","GAME 4","TOTAL"]
[{"$f":"IFERROR(INDEX(tScores[Name],MATCH(C37&\"-\"&B37,tScores[Starting],0),1),\"\")","v":"Jeremy Bartz"}]
["Totals"]
["+/-"]
[]
["SPOT/LANE","B",{"$f":"C37","v":5},{"$f":"D37","v":9},13,17]
[null,null,"GAME 1","GAME 2","GAME 3 ","GAME 4","TOTAL"]
[{"$f":"IFERROR(INDEX(tScores[Name],MATCH(C43&\"-\"&B43,tScores[Starting],0),1),\"\")","v":"Tyler Ladwig"}]
["Totals"]
["+/-"]
[]
["SPOT/LANE","C",{"$f":"C37","v":5},{"$f":"D37","v":9},13,17]
[null,null,"GAME 1","GAME 2","GAME 3 ","GAME 4","TOTAL"]
[{"$f":"IFERROR(INDEX(tScores[Name],MATCH(C49&\"-\"&B49,tScores[Starting],0),1),\"\")","v":""}]
["Totals"]
["+/-"]
[]
["SPOT/LANE","D",{"$f":"C37+1","v":6},{"$f":"D37+1","v":10},14,18]
[null,null,"GAME 1","GAME 2","GAME 3 ","GAME 4","TOTAL"]
[{"$f":"IFERROR(INDEX(tScores[Name],MATCH(C55&\"-\"&B55,tScores[Starting],0),1),\"\")","v":"John Thomasma"}]
["Totals"]
["+/-"]
[]
["SPOT/LANE","E",{"$f":"C55","v":6},{"$f":"D55","v":10},14,18]
[null,null,"GAME 1","GAME 2","GAME 3 ","GAME 4","TOTAL"]
[{"$f":"IFERROR(INDEX(tScores[Name],MATCH(C61&\"-\"&B61,tScores[Starting],0),1),\"\")","v":"Matt DeHaan"}]
["Totals"]
["+/-"]
[]
["SPOT/LANE","F",{"$f":"C55","v":6},{"$f":"D55","v":10},14,18]
[null,null,"GAME 1","GAME 2","GAME 3 ","GAME 4","TOTAL"]
[{"$f":"IFERROR(INDEX(tScores[Name],MATCH(C67&\"-\"&B67,tScores[Starting],0),1),\"\")","v":""}]
["Totals"]
["+/-"]
["SPOT/LANE","A",{"$f":"MAX($C$2:C71)+1","v":7},{"$f":"IF(C72+4>eLane,C72-(eLane-sLane)+3,C72+4)","v":11},{"$f":"IF(D72+4>eLane,D72-(eLane-sLane)+3,D72+4)","v":15},{"$f":"IF(E72+4>eLane,E72-(eLane-sLane)+3,E72+4)","v":3}]
[null,null,"GAME 1","GAME 2","GAME 3 ","GAME 4","TOTAL"]
[{"$f":"IFERROR(INDEX(tScores[Name],MATCH(C72&\"-\"&B72,tScores[Starting],0),1),\"\")","v":"Randy Hawks"}]
["Totals"]
["+/-"]
[]
["SPOT/LANE","B",{"$f":"C72","v":7},{"$f":"D72","v":11},15,3]
[null,null,"GAME 1","GAME 2","GAME 3 ","GAME 4","TOTAL"]
[{"$f":"IFERROR(INDEX(tScores[Name],MATCH(C78&\"-\"&B78,tScores[Starting],0),1),\"\")","v":"Derek  Nyenhuis"}]
["Totals"]
["+/-"]
[]
["SPOT/LANE","C",{"$f":"C72","v":7},{"$f":"D72","v":11},15,3]
[null,null,"GAME 1","GAME 2","GAME 3 ","GAME 4","TOTAL"]
[{"$f":"IFERROR(INDEX(tScores[Name],MATCH(C84&\"-\"&B84,tScores[Starting],0),1),\"\")","v":""}]
["Totals"]
["+/-"]
[]
["SPOT/LANE","D",{"$f":"C72+1","v":8},{"$f":"D72+1","v":12},16,4]
[null,null,"GAME 1","GAME 2","GAME 3 ","GAME 4","TOTAL"]
[{"$f":"IFERROR(INDEX(tScores[Name],MATCH(C90&\"-\"&B90,tScores[Starting],0),1),\"\")","v":"Mike Horian"}]
["Totals"]
["+/-"]
[]
["SPOT/LANE","E",{"$f":"C90","v":8},{"$f":"D90","v":12},16,4]
[null,null,"GAME 1","GAME 2","GAME 3 ","GAME 4","TOTAL"]
[{"$f":"IFERROR(INDEX(tScores[Name],MATCH(C96&\"-\"&B96,tScores[Starting],0),1),\"\")","v":"Jordan Kaufman"}]
["Totals"]
["+/-"]
[]
["SPOT/LANE","F",{"$f":"C90","v":8},{"$f":"D90","v":12},16,4]
[null,null,"GAME 1","GAME 2","GAME 3 ","GAME 4","TOTAL"]
[{"$f":"IFERROR(INDEX(tScores[Name],MATCH(C102&\"-\"&B102,tScores[Starting],0),1),\"\")","v":""}]
["Totals"]
["+/-"]
["SPOT/LANE","A",{"$f":"MAX($C$2:C106)+1","v":9},{"$f":"IF(C107+4>eLane,C107-(eLane-sLane)+3,C107+4)","v":13},{"$f":"IF(D107+4>eLane,D107-(eLane-sLane)+3,D107+4)","v":17},{"$f":"IF(E107+4>eLane,E107-(eLane-sLane)+3,E107+4)","v":5}]
[null,null,"GAME 1","GAME 2","GAME 3 ","GAME 4","TOTAL"]
[{"$f":"IFERROR(INDEX(tScores[Name],MATCH(C107&\"-\"&B107,tScores[Starting],0),1),\"\")","v":"Tom Morgan"}]
["Totals"]
["+/-"]
[]
["SPOT/LANE","B",{"$f":"C107","v":9},{"$f":"D107","v":13},17,5]
[null,null,"GAME 1","GAME 2","GAME 3 ","GAME 4","TOTAL"]
[{"$f":"IFERROR(INDEX(tScores[Name],MATCH(C113&\"-\"&B113,tScores[Starting],0),1),\"\")","v":"Tim Huizinga"}]
["Totals"]
["+/-"]
[]
["SPOT/LANE","C",{"$f":"C107","v":9},{"$f":"D107","v":13},17,5]
[null,null,"GAME 1","GAME 2","GAME 3 ","GAME 4","TOTAL"]
[{"$f":"IFERROR(INDEX(tScores[Name],MATCH(C119&\"-\"&B119,tScores[Starting],0),1),\"\")","v":""}]
["Totals"]
["+/-"]
[]
["SPOT/LANE","D",{"$f":"C107+1","v":10},{"$f":"D107+1","v":14},18,6]
[null,null,"GAME 1","GAME 2","GAME 3 ","GAME 4","TOTAL"]
[{"$f":"IFERROR(INDEX(tScores[Name],MATCH(C125&\"-\"&B125,tScores[Starting],0),1),\"\")","v":"Aaron Groendyk"}]
["Totals"]
["+/-"]
[]
["SPOT/LANE","E",{"$f":"C125","v":10},{"$f":"D125","v":14},18,6]
[null,null,"GAME 1","GAME 2","GAME 3 ","GAME 4","TOTAL"]
[{"$f":"IFERROR(INDEX(tScores[Name],MATCH(C131&\"-\"&B131,tScores[Starting],0),1),\"\")","v":"Eric Scott"}]
["Totals"]
["+/-"]
[]
["SPOT/LANE","F",{"$f":"C125","v":10},{"$f":"D125","v":14},18,6]
[null,null,"GAME 1","GAME 2","GAME 3 ","GAME 4","TOTAL"]
[{"$f":"IFERROR(INDEX(tScores[Name],MATCH(C137&\"-\"&B137,tScores[Starting],0),1),\"\")","v":""}]
["Totals"]
["+/-"]
["SPOT/LANE","A",{"$f":"MAX($C$2:C141)+1","v":11},{"$f":"IF(C142+4>eLane,C142-(eLane-sLane)+3,C142+4)","v":15},{"$f":"IF(D142+4>eLane,D142-(eLane-sLane)+3,D142+4)","v":3},{"$f":"IF(E142+4>eLane,E142-(eLane-sLane)+3,E142+4)","v":7}]
[null,null,"GAME 1","GAME 2","GAME 3 ","GAME 4","TOTAL"]
[{"$f":"IFERROR(INDEX(tScores[Name],MATCH(C142&\"-\"&B142,tScores[Starting],0),1),\"\")","v":"Mel Atkins"}]
["Totals"]
["+/-"]
[]
["SPOT/LANE","B",{"$f":"C142","v":11},{"$f":"D142","v":15},3,7]
[null,null,"GAME 1","GAME 2","GAME 3 ","GAME 4","TOTAL"]
[{"$f":"IFERROR(INDEX(tScores[Name],MATCH(C148&\"-\"&B148,tScores[Starting],0),1),\"\")","v":"Dan Bailey"}]
["Totals"]
["+/-"]
[]
["SPOT/LANE","C",{"$f":"C142","v":11},{"$f":"D142","v":15},3,7]
[null,null,"GAME 1","GAME 2","GAME 3 ","GAME 4","TOTAL"]
[{"$f":"IFERROR(INDEX(tScores[Name],MATCH(C154&\"-\"&B154,tScores[Starting],0),1),\"\")","v":""}]
["Totals"]
["+/-"]
[]
["SPOT/LANE","D",{"$f":"C142+1","v":12},{"$f":"D142+1","v":16},4,8]
[null,null,"GAME 1","GAME 2","GAME 3 ","GAME 4","TOTAL"]
[{"$f":"IFERROR(INDEX(tScores[Name],MATCH(C160&\"-\"&B160,tScores[Starting],0),1),\"\")","v":"Bill Orlikowski"}]
["Totals"]
["+/-"]
[]
["SPOT/LANE","E",{"$f":"C160","v":12},{"$f":"D160","v":16},4,8]
[null,null,"GAME 1","GAME 2","GAME 3 ","GAME 4","TOTAL"]
[{"$f":"IFERROR(INDEX(tScores[Name],MATCH(C166&\"-\"&B166,tScores[Starting],0),1),\"\")","v":"Ryan Ross"}]
["Totals"]
["+/-"]
[]
["SPOT/LANE","F",{"$f":"C160","v":12},{"$f":"D160","v":16},4,8]
[null,null,"GAME 1","GAME 2","GAME 3 ","GAME 4","TOTAL"]
[{"$f":"IFERROR(INDEX(tScores[Name],MATCH(C172&\"-\"&B172,tScores[Starting],0),1),\"\")","v":""}]
["Totals"]
["+/-"]
["SPOT/LANE","A",{"$f":"MAX($C$2:C176)+1","v":13},{"$f":"IF(C177+4>eLane,C177-(eLane-sLane)+3,C177+4)","v":17},{"$f":"IF(D177+4>eLane,D177-(eLane-sLane)+3,D177+4)","v":5},{"$f":"IF(E177+4>eLane,E177-(eLane-sLane)+3,E177+4)","v":9}]
[null,null,"GAME 1","GAME 2","GAME 3 ","GAME 4","TOTAL"]
[{"$f":"IFERROR(INDEX(tScores[Name],MATCH(C177&\"-\"&B177,tScores[Starting],0),1),\"\")","v":"Mike Smith Jr"}]
["Totals"]
["+/-"]
[]
["SPOT/LANE","B",{"$f":"C177","v":13},{"$f":"D177","v":17},5,9]
[null,null,"GAME 1","GAME 2","GAME 3 ","GAME 4","TOTAL"]
[{"$f":"IFERROR(INDEX(tScores[Name],MATCH(C183&\"-\"&B183,tScores[Starting],0),1),\"\")","v":"Mike Lipzinski"}]
["Totals"]
["+/-"]
[]
["SPOT/LANE","C",{"$f":"C177","v":13},{"$f":"D177","v":17},5,9]
[null,null,"GAME 1","GAME 2","GAME 3 ","GAME 4","TOTAL"]
[{"$f":"IFERROR(INDEX(tScores[Name],MATCH(C189&\"-\"&B189,tScores[Starting],0),1),\"\")","v":""}]
["Totals"]
["+/-"]
[]
["SPOT/LANE","D",{"$f":"C177+1","v":14},{"$f":"D177+1","v":18},6,10]
[null,null,"GAME 1","GAME 2","GAME 3 ","GAME 4","TOTAL"]
[{"$f":"IFERROR(INDEX(tScores[Name],MATCH(C195&\"-\"&B195,tScores[Starting],0),1),\"\")","v":"Don Nyenhuis Jr"}]
["Totals"]
["+/-"]
[]
["SPOT/LANE","E",{"$f":"C195","v":14},{"$f":"D195","v":18},6,10]
[null,null,"GAME 1","GAME 2","GAME 3 ","GAME 4","TOTAL"]
[{"$f":"IFERROR(INDEX(tScores[Name],MATCH(C201&\"-\"&B201,tScores[Starting],0),1),\"\")","v":"Ben Rabourn"}]
["Totals"]
["+/-"]
[]
["SPOT/LANE","F",{"$f":"C195","v":14},{"$f":"D195","v":18},6,10]
[null,null,"GAME 1","GAME 2","GAME 3 ","GAME 4","TOTAL"]
[{"$f":"IFERROR(INDEX(tScores[Name],MATCH(C207&\"-\"&B207,tScores[Starting],0),1),\"\")","v":""}]
["Totals"]
["+/-"]
["SPOT/LANE","A",{"$f":"MAX($C$2:C211)+1","v":15},{"$f":"IF(C212+4>eLane,C212-(eLane-sLane)+3,C212+4)","v":3},{"$f":"IF(D212+4>eLane,D212-(eLane-sLane)+3,D212+4)","v":7},{"$f":"IF(E212+4>eLane,E212-(eLane-sLane)+3,E212+4)","v":11}]
[null,null,"GAME 1","GAME 2","GAME 3 ","GAME 4","TOTAL"]
[{"$f":"IFERROR(INDEX(tScores[Name],MATCH(C212&\"-\"&B212,tScores[Starting],0),1),\"\")","v":"Matt Jelsma"}]
["Totals"]
["+/-"]
[]
["SPOT/LANE","B",{"$f":"C212","v":15},{"$f":"D212","v":3},7,11]
[null,null,"GAME 1","GAME 2","GAME 3 ","GAME 4","TOTAL"]
[{"$f":"IFERROR(INDEX(tScores[Name],MATCH(C218&\"-\"&B218,tScores[Starting],0),1),\"\")","v":"Chris Slagter"}]
["Totals"]
["+/-"]
[]
["SPOT/LANE","C",{"$f":"C212","v":15},{"$f":"D212","v":3},7,11]
[null,null,"GAME 1","GAME 2","GAME 3 ","GAME 4","TOTAL"]
[{"$f":"IFERROR(INDEX(tScores[Name],MATCH(C224&\"-\"&B224,tScores[Starting],0),1),\"\")","v":""}]
["Totals"]
["+/-"]
[]
["SPOT/LANE","D",{"$f":"C212+1","v":16},{"$f":"D212+1","v":4},8,12]
[null,null,"GAME 1","GAME 2","GAME 3 ","GAME 4","TOTAL"]
[{"$f":"IFERROR(INDEX(tScores[Name],MATCH(C230&\"-\"&B230,tScores[Starting],0),1),\"\")","v":"Chad Reiffer"}]
["Totals"]
["+/-"]
[]
["SPOT/LANE","E",{"$f":"C230","v":16},{"$f":"D230","v":4},8,12]
[null,null,"GAME 1","GAME 2","GAME 3 ","GAME 4","TOTAL"]
[{"$f":"IFERROR(INDEX(tScores[Name],MATCH(C236&\"-\"&B236,tScores[Starting],0),1),\"\")","v":"Jeremy Pettenger"}]
["Totals"]
["+/-"]
[]
["SPOT/LANE","F",{"$f":"C230","v":16},{"$f":"D230","v":4},8,12]
[null,null,"GAME 1","GAME 2","GAME 3 ","GAME 4","TOTAL"]
[{"$f":"IFERROR(INDEX(tScores[Name],MATCH(C242&\"-\"&B242,tScores[Starting],0),1),\"\")","v":""}]
["Totals"]
["+/-"]
["SPOT/LANE","A",{"$f":"MAX($C$2:C246)+1","v":17},{"$f":"IF(C247+4>eLane,C247-(eLane-sLane)+3,C247+4)","v":5},{"$f":"IF(D247+4>eLane,D247-(eLane-sLane)+3,D247+4)","v":9},{"$f":"IF(E247+4>eLane,E247-(eLane-sLane)+3,E247+4)","v":13}]
[null,null,"GAME 1","GAME 2","GAME 3 ","GAME 4","TOTAL"]
[{"$f":"IFERROR(INDEX(tScores[Name],MATCH(C247&\"-\"&B247,tScores[Starting],0),1),\"\")","v":"John Powney"}]
["Totals"]
["+/-"]
[]
["SPOT/LANE","B",{"$f":"C247","v":17},{"$f":"D247","v":5},9,13]
[null,null,"GAME 1","GAME 2","GAME 3 ","GAME 4","TOTAL"]
[{"$f":"IFERROR(INDEX(tScores[Name],MATCH(C253&\"-\"&B253,tScores[Starting],0),1),\"\")","v":"Brad Nawrocki"}]
["Totals"]
["+/-"]
[]
["SPOT/LANE","C",{"$f":"C247","v":17},{"$f":"D247","v":5},9,13]
[null,null,"GAME 1","GAME 2","GAME 3 ","GAME 4","TOTAL"]
[{"$f":"IFERROR(INDEX(tScores[Name],MATCH(C259&\"-\"&B259,tScores[Starting],0),1),\"\")","v":""}]
["Totals"]
["+/-"]
[]
["SPOT/LANE","D",{"$f":"C247+1","v":18},{"$f":"D247+1","v":6},10,14]
[null,null,"GAME 1","GAME 2","GAME 3 ","GAME 4","TOTAL"]
[{"$f":"IFERROR(INDEX(tScores[Name],MATCH(C265&\"-\"&B265,tScores[Starting],0),1),\"\")","v":"George Miller"}]
["Totals"]
["+/-"]
[]
["SPOT/LANE","E",{"$f":"C265","v":18},{"$f":"D265","v":6},10,14]
[null,null,"GAME 1","GAME 2","GAME 3 ","GAME 4","TOTAL"]
[{"$f":"IFERROR(INDEX(tScores[Name],MATCH(C271&\"-\"&B271,tScores[Starting],0),1),\"\")","v":"Charlie Brown II"}]
["Totals"]
["+/-"]
[]
["SPOT/LANE","F",{"$f":"C265","v":18},{"$f":"D265","v":6},10,14]
[null,null,"GAME 1","GAME 2","GAME 3 ","GAME 4","TOTAL"]
[{"$f":"IFERROR(INDEX(tScores[Name],MATCH(C277&\"-\"&B277,tScores[Starting],0),1),\"\")","v":""}]
["Totals"]
["+/-"]

{"sheet":"ScoreSheet-MP","index":4,"n_rows":42,"n_cols":6,"rows_kept":42,"cut":false,"hidden":false,"merged":[[38,0,38,5],[13,0,13,5],[18,0,18,5],[23,0,23,5],[28,0,28,5],[33,0,33,5],[0,0,0,5],[1,3,1,5],[3,0,3,5],[2,3,2,4],[8,0,8,5]]}
[]
["SEED",8,"NAME",{"$f":"IFERROR(VLOOKUP(B2,Standings!$B$3:$C$10,2,0),\"\")","v":"Mike Horian"}]
[null,null,null,"QUAL TOTAL",null,{"$f":"IFERROR(VLOOKUP(B2,Standings!$B$3:$H$10,7,0),\"\")","v":918.02679999999998}]
["MATCH 1"]
["LANES:",{"$f":"INDEX('Round Robin-StepLadder'!$A$4:$A$11,MATCH('ScoreSheet-MP'!B2,'Round Robin-StepLadder'!$C$4:$C$11,0))","v":"11-12"},null,"GAME","BONUS","TOTAL"]
[null,null,{"$f":"$D$2","v":"Mike Horian"}]
["SEED:",{"$f":"VLOOKUP($B$2,tMatches[],COUNTIF($A$5:A5,A5)+1,0)","v":7},{"$f":"VLOOKUP(B7,Standings!$B$3:$C$10,2,0)","v":"Ben Rabourn"}]
[]
["MATCH 2"]
["LANES:",{"$f":"INDEX('Round Robin-StepLadder'!$A$4:$A$11,MATCH('ScoreSheet-MP'!B12,'Round Robin-StepLadder'!$I$4:$I$11,0))","v":" 5-6"},null,"GAME","BONUS","TOTAL"]
[null,null,{"$f":"$D$2","v":"Mike Horian"}]
["SEED:",{"$f":"VLOOKUP($B$2,tMatches[],COUNTIF($A$5:A10,A10)+1,0)","v":6},{"$f":"IFERROR(VLOOKUP(B12,Standings!$B$3:$C$10,2,0),\"\")","v":"Steve Marcus"}]
[]
["MATCH 3"]
["LANES:",{"$f":"INDEX('Round Robin-StepLadder'!$A$4:$A$11,MATCH('ScoreSheet-MP'!B17,'Round Robin-StepLadder'!$O$4:$O$11,0))","v":" 7-8"},null,"GAME","BONUS","TOTAL"]
[null,null,{"$f":"$D$2","v":"Mike Horian"}]
["SEED:",{"$f":"VLOOKUP($B$2,tMatches[],COUNTIF($A$5:A15,A15)+1,0)","v":1},{"$f":"IFERROR(VLOOKUP(B17,Standings!$B$3:$C$10,2,0),\"\")","v":"George Miller"}]
[]
["MATCH 4"]
["LANES:",{"$f":"INDEX('Round Robin-StepLadder'!$A$4:$A$11,MATCH('ScoreSheet-MP'!B22,'Round Robin-StepLadder'!$U$4:$U$11,0))","v":"11-12"},null,"GAME","BONUS","TOTAL"]
[null,null,{"$f":"$D$2","v":"Mike Horian"}]
["SEED:",{"$f":"VLOOKUP($B$2,tMatches[],COUNTIF($A$5:A20,A20)+1,0)","v":4},{"$f":"IFERROR(VLOOKUP(B22,Standings!$B$3:$C$10,2,0),\"\")","v":"Aaron Groendyk"}]
[]
["MATCH 5"]
["LANES:",{"$f":"INDEX('Round Robin-StepLadder'!$A$15:$A$22,MATCH('ScoreSheet-MP'!B27,'Round Robin-StepLadder'!$C$15:$C$22,0))","v":" 9-10"},null,"GAME","BONUS","TOTAL"]
[null,null,{"$f":"$D$2","v":"Mike Horian"}]
["SEED:",{"$f":"VLOOKUP($B$2,tMatches[],COUNTIF($A$5:A25,A25)+1,0)","v":3},{"$f":"IFERROR(VLOOKUP(B27,Standings!$B$3:$C$10,2,0),\"\")","v":"Eric Scott"}]
[]
["MATCH 6"]
["LANES:",{"$f":"INDEX('Round Robin-StepLadder'!$A$15:$A$22,MATCH('ScoreSheet-MP'!B32,'Round Robin-StepLadder'!$I$15:$I$22,0))","v":" 7-8"},null,"GAME","BONUS","TOTAL"]
[null,null,{"$f":"$D$2","v":"Mike Horian"}]
["SEED:",{"$f":"VLOOKUP($B$2,tMatches[],COUNTIF($A$5:A30,A30)+1,0)","v":5},{"$f":"IFERROR(VLOOKUP(B32,Standings!$B$3:$C$10,2,0),\"\")","v":"Chris Slagter"}]
[]
["MATCH 7"]
["LANES:",{"$f":"INDEX('Round Robin-StepLadder'!$A$15:$A$22,MATCH('ScoreSheet-MP'!B37,'Round Robin-StepLadder'!$O$15:$O$22,0))","v":" 9-10"},null,"GAME","BONUS","TOTAL"]
[null,null,{"$f":"$D$2","v":"Mike Horian"}]
["SEED:",{"$f":"VLOOKUP($B$2,tMatches[],COUNTIF($A$5:A35,A35)+1,0)","v":2},{"$f":"IFERROR(VLOOKUP(B37,Standings!$B$3:$C$10,2,0),\"\")","v":"Mike Smith Jr"}]
[]
["MATCH 8"]
["LANES:",null,null,"GAME","BONUS","TOTAL"]
[null,null,{"$f":"$D$2","v":"Mike Horian"}]
["SEED:"]

{"sheet":"RR Seeds","index":5,"n_rows":10,"n_cols":8,"rows_kept":10,"cut":false,"hidden":true,"merged":[]}
[]
["SEED","GAME1","GAME2","GAME3","GAME4","GAME5","GAME6","GAME7"]
[1,2,3,8,5,7,4,6]
[2,1,4,6,7,5,3,8]
[3,4,1,7,6,8,2,5]
[4,3,2,5,8,6,1,7]
[5,6,7,4,1,2,8,3]
[6,5,8,2,3,4,7,1]
[7,8,5,3,2,1,6,4]
[8,7,6,1,4,3,5,2]