{"text_format":"1","workbook":"xlsx","n_sheets":6,"sheets":["Registration-Qualifying","Round Robin-StepLadder","Standings","ScoreSheets","ScoreSheet-MP","RR Seeds"],"not_rendered":{"charts":0,"images":1,"macros":1,"external_links":1,"defined_names":40,"comments":0,"pivot_tables":0},"unopened":[],"bounds":{"document_bytes":16777216,"sheet_cells":100000,"rows_first":2000,"rows_last":500,"rows_between":2000,"halvings":0,"cell_chars":16384,"cell_head_chars":4096},"cells_cut":0,"cells_raw":0,"read":"whole","date_system":"1900"}

{"sheet":"Registration-Qualifying","index":0,"n_rows":35,"n_cols":36,"rows_kept":35,"cut":false,"hidden":false,"merged":[[0,4,0,8]]}
[null,null,null,null,"1st Round",null,null,null,null,null,null,null,null,null,null,null,null,null,null,null,null,null,null,null,null,null,null,null,null,null,null,null,null,"# of Bowlers","Starting","Ending"]
["Lane","Pos","Starting","Name","Game1","Game2","Game3","Game4","Total","RANK1","RR1","RR2","RR3","RR4","RR5","RR6","RR7","RR Total","B1","B2","B3","B4","B5","B6","B7","Btotal","SUBTotal","RankST","RR8","B8","GT","RankGT",null,{"$f":"COUNTA(D:D)-1","v":33},{"$f":"MIN(tScores[Lane])","v":3},{"$f":"MAX(tScores[Lane])","v":18}]
[3,"A",{"$f":"IF(tScores[[#This Row],[Name]]=\"\",\"\",tScores[[#This Row],[Lane]]&\"-\"&tScores[[#This Row],[Pos]])","v":"3-A"},"Steve Marcus",249,237,213,233,{"$f":"IFERROR(IF(tScores[[#This Row],[Name]]=\"\",\"\",SUM(tScores[[#This Row],[Game1]:[Game4]]))+MAX(tScores[[#This Row],[Game1]:[Game4]])/10000,\"\")","v":932.0249},{"$f":"IF(tScores[[#This Row],[Name]]=\"\",\"\",RANK(tScores[[#This Row],[Total]],tScores[Total])+(COUNTIF($I$3:$I3,tScores[[#This Row],[Total]]))-1)","v":6},{"$f":"IFERROR(VLOOKUP(tScores[[#This Row],[Name]],RRGM1,2,0),\"\")","v":235},{"$f":"IFERROR(VLOOKUP(tScores[[#This Row],[Name]],RRGM2,2,0),\"\")","v":145},{"$f":"IFERROR(VLOOKUP(tScores[[#This Row],[Name]],RRGM3,2,0),\"\")","v":195},{"$f":"IFERROR(VLOOKUP(tScores[[#This Row],[Name]],RRGM4,2,0),\"\")","v":192},{"$f":"IFERROR(VLOOKUP(tScores[[#This Row],[Name]],RRGM5,2,0),\"\")","v":190},{"$f":"IFERROR(VLOOKUP(tScores[[#This Row],[Name]],RRGM6,2,0),\"\")","v":214},{"$f":"IFERROR(VLOOKUP(tScores[[#This Row],[Name]],RRGM7,2,0),\"\")","v":195},{"$f":"SUM(tScores[[#This Row],[RR1]:[RR7]])+MAX(tScores[[#This Row],[RANK1]:[RR7]])/10000","v":1366.0235},{"$f":"IFERROR(VLOOKUP(tScores[[#This Row],[Name]],RRGM1,3,0),\"\")","v":30},{"$f":"IFERROR(VLOOKUP(tScores[[#This Row],[Name]],RRGM2,3,0),\"\")","v":0},{"$f":"IFERROR(VLOOKUP(tScores[[#This Row],[Name]],RRGM3,3,0),\"\")","v":30},{"$f":"IFERROR(VLOOKUP(tScores[[#This Row],[Name]],RRGM4,3,0),\"\")","v":30},{"$f":"IFERROR(VLOOKUP(tScores[[#This Row],[Name]],RRGM5,3,0),\"\")","v":0},{"$f":"IFERROR(VLOOKUP(tScores[[#This Row],[Name]],RRGM6,3,0),\"\")","v":0},{"$f":"IFERROR(VLOOKUP(tScores[[#This Row],[Name]],RRGM7,3,0),\"\")","v":30},{"$f":"SUM(tScores[[#This Row],[B1]:[B7]])","v":120},{"$f":"IFERROR(tScores[[#This Row],[Total]]+tScores[[#This Row],[RR Total]]+tScores[[#This Row],[Btotal]],\"\")","v":2418.0484000000001},{"$f":"IF(tScores[[#This Row],[Name]]=\"\",\"\",RANK(tScores[[#This Row],[SUBTotal]],tScores[SUBTotal])+(COUNTIF($AA$3:$AA3,tScores[[#This Row],[SUBTotal]]))-1)","v":7},{"$f":"IFERROR(VLOOKUP(tScores[[#This Row],[Name]],RRGM8,2,0),\"\")","v":197},{"$f":"IFERROR(VLOOKUP(tScores[[#This Row],[Name]],RRGM8,3,0),\"\")","v":30},{"$f":"IFERROR(tScores[[#This Row],[SUBTotal]]+SUM(tScores[[#This Row],[RR8]:[B8]]),\"\")","v":2645.0484000000001},{"$f":"IF(tScores[[#This Row],[Name]]=\"\",\"\",RANK(tScores[[#This Row],[GT]],tScores[GT])+(COUNTIF($AE$3:$AE3,tScores[[#This Row],[GT]]))-1)","v":7}]
[3,"b",{"$f":"IF(tScores[[#This Row],[Name]]=\"\",\"\",tScores[[#This Row],[Lane]]&\"-\"&tScores[[#This Row],[Pos]])","v":"3-b"},"Don Veltman",259,196,214,217,{"$f":"IFERROR(IF(tScores[[#This Row],[Name]]=\"\",\"\",SUM(tScores[[#This Row],[Game1]:[Game4]]))+MAX(tScores[[#This Row],[Game1]:[Game4]])/10000,\"\")","v":886.02589999999998},{"$f":"IF(tScores[[#This Row],[Name]]=\"\",\"\",RANK(tScores[[#This Row],[Total]],tScores[Total])+(COUNTIF($I$3:$I4,tScores[[#This Row],[Total]]))-1)","v":11},{"$f":"IFERROR(VLOOKUP(tScores[[#This Row],[Name]],RRGM1,2,0),\"\")","v":""},{"$f":"IFERROR(VLOOKUP(tScores[[#This Row],[Name]],RRGM2,2,0),\"\")","v":""},{"$f":"IFERROR(VLOOKUP(tScores[[#This Row],[Name]],RRGM3,2,0),\"\")","v":""},{"$f":"IFERROR(VLOOKUP(tScores[[#This Row],[Name]],RRGM4,2,0),\"\")","v":""},{"$f":"IFERROR(VLOOKUP(tScores[[#This Row],[Name]],RRGM5,2,0),\"\")","v":""},{"$f":"IFERROR(VLOOKUP(tScores[[#This Row],[Name]],RRGM6,2,0),\"\")","v":""},{"$f":"IFERROR(VLOOKUP(tScores[[#This Row],[Name]],RRGM7,2,0),\"\")","v":""},{"$f":"SUM(tScores[[#This Row],[RR1]:[RR7]])+MAX(tScores[[#This Row],[RANK1]:[RR7]])/10000","v":1.1000000000000001E-3},{"$f":"IFERROR(VLOOKUP(tScores[[#This Row],[Name]],RRGM1,3,0),\"\")","v":""},{"$f":"IFERROR(VLOOKUP(tScores[[#This Row],[Name]],RRGM2,3,0),\"\")","v":""},{"$f":"IFERROR(VLOOKUP(tScores[[#This Row],[Name]],RRGM3,3,0),\"\")","v":""},{"$f":"IFERROR(VLOOKUP(tScores[[#This Row],[Name]],RRGM4,3,0),\"\")","v":""},{"$f":"IFERROR(VLOOKUP(tScores[[#This Row],[Name]],RRGM5,3,0),\"\")","v":""},{"$f":"IFERROR(VLOOKUP(tScores[[#This Row],[Name]],RRGM6,3,0),\"\")","v":""},{"$f":"IFERROR(VLOOKUP(tScores[[#This Row],[Name]],RRGM7,3,0),\"\")","v":""},{"$f":"SUM(tScores[[#This Row],[B1]:[B7]])","v":0},{"$f":"IFERROR(tScores[[#This Row],[Total]]+tScores[[#This Row],[RR Total]]+tScores[[#This Row],[Btotal]],\"\")","v":886.02699999999993},{"$f":"IF(tScores[[#This Row],[Name]]=\"\",\"\",RANK(tScores[[#This Row],[SUBTotal]],tScores[SUBTotal])+(COUNTIF($AA$3:$AA4,tScores[[#This Row],[SUBTotal]]))-1)","v":11},{"$f":"IFERROR(VLOOKUP(tScores[[#This Row],[Name]],RRGM8,2,0),\"\")","v":""},{"$f":"IFERROR(VLOOKUP(tScores[[#This Row],[Name]],RRGM8,3,0),\"\")","v":""},{"$f":"IFERROR(tScores[[#This Row],[SUBTotal]]+SUM(tScores[[#This Row],[RR8]:[B8]]),\"\")","v":886.02699999999993},{"$f":"IF(tScores[[#This Row],[Name]]=\"\",\"\",RANK(tScores[[#This Row],[GT]],tScores[GT])+(COUNTIF($AE$3:$AE4,tScores[[#This Row],[GT]]))-1)","v":11}]
[3,"c",{"$f":"IF(tScores[[#This Row],[Name]]=\"\",\"\",tScores[[#This Row],[Lane]]&\"-\"&tScores[[#This Row],[Pos]])","v":"3-c"},"Eric Bottrall",211,150,204,210,{"$f":"IFERROR(IF(tScores[[#This Row],[Name]]=\"\",\"\",SUM(tScores[[#This Row],[Game1]:[Game4]]))+MAX(tScores[[#This Row],[Game1]:[Game4]])/10000,\"\")","v":775.02110000000005},{"$f":"IF(tScores[[#This Row],[Name]]=\"\",\"\",RANK(tScores[[#This Row],[Total]],tScores[Total])+(COUNTIF($I$3:$I5,tScores[[#This Row],[Total]]))-1)","v":28},{"$f":"IFERROR(VLOOKUP(tScores[[#This Row],[Name]],RRGM1,2,0),\"\")","v":""},{"$f":"IFERROR(VLOOKUP(tScores[[#This Row],[Name]],RRGM2,2,0),\"\")","v":""},{"$f":"IFERROR(VLOOKUP(tScores[[#This Row],[Name]],RRGM3,2,0),\"\")","v":""},{"$f":"IFERROR(VLOOKUP(tScores[[#This Row],[Name]],RRGM4,2,0),\"\")","v":""},{"$f":"IFERROR(VLOOKUP(tScores[[#This Row],[Name]],RRGM5,2,0),\"\")","v":""},{"$f":"IFERROR(VLOOKUP(tScores[[#This Row],[Name]],RRGM6,2,0),\"\")","v":""},{"$f":"IFERROR(VLOOKUP(tScores[[#This Row],[Name]],RRGM7,2,0),\"\")","v":""},{"$f":"SUM(tScores[[#This Row],[RR1]:[RR7]])+MAX(tScores[[#This Row],[RANK1]:[RR7]])/10000","v":2.8E-3},{"$f":"IFERROR(VLOOKUP(tScores[[#This Row],[Name]],RRGM1,3,0),\"\")","v":""},{"$f":"IFERROR(VLOOKUP(tScores[[#This Row],[Name]],RRGM2,3,0),\"\")","v":""},{"$f":"IFERROR(VLOOKUP(tScores[[#This Row],[Name]],RRGM3,3,0),\"\")","v":""},{"$f":"IFERROR(VLOOKUP(tScores[[#This Row],[Name]],RRGM4,3,0),\"\")","v":""},{"$f":"IFERROR(VLOOKUP(tScores[[#This Row],[Name]],RRGM5,3,0),\"\")","v":""},{"$f":"IFERROR(VLOOKUP(tScores[[#This Row],[Name]],RRGM6,3,0),\"\")","v":""},{"$f":"IFERROR(VLOOKUP(tScores[[#This Row],[Name]],RRGM7,3,0),\"\")","v":""},{"$f":"SUM(tScores[[#This Row],[B1]:[B7]])","v":0},{"$f":"IFERROR(tScores[[#This Row],[Total]]+tScores[[#This Row],[RR Total]]+tScores[[#This Row],[Btotal]],\"\")","v":775.02390000000003},{"$f":"IF(tScores[[#This Row],[Name]]=\"\",\"\",RANK(tScores[[#This Row],[SUBTotal]],tScores[SUBTotal])+(COUNTIF($AA$3:$AA5,tScores[[#This Row],[SUBTotal]]))-1)","v":28},{"$f":"IFERROR(VLOOKUP(tScores[[#This Row],[Name]],RRGM8,2,0),\"\")","v":""},{"$f":"IFERROR(VLOOKUP(tScores[[#This Row],[Name]],RRGM8,3,0),\"\")","v":""},{"$f":"IFERROR(tScores[[#This Row],[SUBTotal]]+SUM(tScores[[#This Row],[RR8]:[B8]]),\"\")","v":775.02390000000003},{"$f":"IF(tScores[[#This Row],[Name]]=\"\",\"\",RANK(tScores[[#This Row],[GT]],tScores[GT])+(COUNTIF($AE$3:$AE5,tScores[[#This Row],[GT]]))-1)","v":28}]
[4,"d",{"$f":"IF(tScores[[#This Row],[Name]]=\"\",\"\",tScores[[#This Row],[Lane]]&\"-\"&tScores[[#This Row],[Pos]])","v":"4-d"},"David Napier",203,180,211,175,{"$f":"IFERROR(IF(tScores[[#This Row],[Name]]=\"\",\"\",SUM(tScores[[#This Row],[Game1]:[Game4]]))+MAX(tScores[[#This Row],[Game1]:[Game4]])/10000,\"\")","v":769.02110000000005},{"$f":"IF(tScores[[#This Row],[Name]]=\"\",\"\",RANK(tScores[[#This Row],[Total]],tScores[Total])+(COUNTIF($I$3:$I6,tScores[[#This Row],[Total]]))-1)","v":29},{"$f":"IFERROR(VLOOKUP(tScores[[#This Row],[Name]],RRGM1,2,0),\"\")","v":""},{"$f":"IFERROR(VLOOKUP(tScores[[#This Row],[Name]],RRGM2,2,0),\"\")","v":""},{"$f":"IFERROR(VLOOKUP(tScores[[#This Row],[Name]],RRGM3,2,0),\"\")","v":""},{"$f":"IFERROR(VLOOKUP(tScores[[#This Row],[Name]],RRGM4,2,0),\"\")","v":""},{"$f":"IFERROR(VLOOKUP(tScores[[#This Row],[Name]],RRGM5,2,0),\"\")","v":""},{"$f":"IFERROR(VLOOKUP(tScores[[#This Row],[Name]],RRGM6,2,0),\"\")","v":""},{"$f":"IFERROR(VLOOKUP(tScores[[#This Row],[Name]],RRGM7,2,0),\"\")","v":""},{"$f":"SUM(tScores[[#This Row],[RR1]:[RR7]])+MAX(tScores[[#This Row],[RANK1]:[RR7]])/10000","v":2.8999999999999998E-3},{"$f":"IFERROR(VLOOKUP(tScores[[#This Row],[Name]],RRGM1,3,0),\"\")","v":""},{"$f":"IFERROR(VLOOKUP(tScores[[#This Row],[Name]],RRGM2,3,0),\"\")","v":""},{"$f":"IFERROR(VLOOKUP(tScores[[#This Row],[Name]],RRGM3,3,0),\"\")","v":""},{"$f":"IFERROR(VLOOKUP(tScores[[#This Row],[Name]],RRGM4,3,0),\"\")","v":""},{"$f":"IFERROR(VLOOKUP(tScores[[#This Row],[Name]],RRGM5,3,0),\"\")","v":""},{"$f":"IFERROR(VLOOKUP(tScores[[#This Row],[Name]],RRGM6,3,0),\"\")","v":""},{"$f":"IFERROR(VLOOKUP(tScores[[#This Row],[Name]],RRGM7,3,0),\"\")","v":""},{"$f":"SUM(tScores[[#This Row],[B1]:[B7]])","v":0},{"$f":"IFERROR(tScores[[#This Row],[Total]]+tScores[[#This Row],[RR Total]]+tScores[[#This Row],[Btotal]],\"\")","v":769.024},{"$f":"IF(tScores[[#This Row],[Name]]=\"\",\"\",RANK(tScores[[#This Row],[SUBTotal]],tScores[SUBTotal])+(COUNTIF($AA$3:$AA6,tScores[[#This Row],[SUBTotal]]))-1)","v":29},{"$f":"IFERROR(VLOOKUP(tScores[[#This Row],[Name]],RRGM8,2,0),\"\")","v":""},{"$f":"IFERROR(VLOOKUP(tScores[[#This Row],[Name]],RRGM8,3,0),\"\")","v":""},{"$f":"IFERROR(tScores[[#This Row],[SUBTotal]]+SUM(tScores[[#This Row],[RR8]:[B8]]),\"\")","v":769.024},{"$f":"IF(tScores[[#This Row],[Name]]=\"\",\"\",RANK(tScores[[#This Row],[GT]],tScores[GT])+(COUNTIF($AE$3:$AE6,tScores[[#This Row],[GT]]))-1)","v":29}]
{"$rows_left_out":30}
{"sheet":"Round Robin-StepLadder","index":1,"n_rows":33,"n_cols":25,"rows_kept":33,"cut":false,"hidden":false,"merged":[[14,1,15,1],[16,1,17,1],[18,1,19,1],[20,1,21,1],[3,1,4,1],[5,1,6,1],[7,1,8,1],[9,1,10,1],[23,21,23,24],[1,20,1,24],[12,20,12,24],[23,5,23,8],[23,4,24,4],[23,13,23,20],[1,2,1,6],[12,2,12,6],[1,8,1,12],[12,8,12,12],[1,14,1,18],[12,14,12,18],[23,9,23,12],[31,22,31,23],[32,22,32,23],[24,22,24,23],[30,13,30,15],[27,15,27,17],[24,17,24,20],[25,22,25,23],[26,22,26,23],[27,22,27,23],[28,22,28,23],[29,22,29,23],[30,22,30,23],[24,14,24,15]]}
[]
[null,null,"Game 1",null,null,null,null,null,"Game 2",null,null,null,null,null,"Game 3",null,null,null,null,null,"Game 4"]
[null,"Lanes","Seed","Name","Score","Bonus","Total",null,"Seed","Name","Score","Bonus","Total",null,"Seed","Name","Score","Bonus","Total",null,"Seed","Name","Score","Bonus","Total"]
[{"$f":"B4","v":" 5-6"}," 5-6",1,{"$f":"IFERROR(VLOOKUP(C4,QUAL,2,0),\"\")","v":"George Miller"},236,{"$f":"IF(E4=\"\",\"\",IF(E4=E5,15,IF(E4>E5,30,0)))","v":30},{"$f":"IFERROR(E4+F4,\"\")","v":266},null,6,{"$f":"IFERROR(VLOOKUP(I4,QUAL,2,0),\"\")","v":"Steve Marcus"},145,{"$f":"IF(K4=\"\",\"\",IF(K4=K5,15,IF(K4>K5,30,0)))","v":0},{"$f":"IFERROR(K4+L4,\"\")","v":145},null,5,{"$f":"IFERROR(VLOOKUP(O4,QUAL,2,0),\"\")","v":"Chris Slagter"},189,{"$f":"IF(Q4=\"\",\"\",IF(Q4=Q5,15,IF(Q4>Q5,30,0)))","v":0},{"$f":"IFERROR(Q4+R4,\"\")","v":189},null,3,{"$f":"IFERROR(VLOOKUP(U4,QUAL,2,0),\"\")","v":"Eric Scott"},170,{"$f":"IF(W4=\"\",\"\",IF(W4=W5,15,IF(W4>W5,30,0)))","v":0},{"$f":"IFERROR(W4+X4,\"\")","v":170}]
[{"$f":"B4","v":" 5-6"},null,2,"Mike Smith Jr",203,{"$f":"IFERROR(30-F4,\"\")","v":0},{"$f":"IFERROR(E5+F5,\"\")","v":203},null,8,"Mike Horian",223,{"$f":"IFERROR(30-L4,\"\")","v":30},{"$f":"IFERROR(K5+L5,\"\")","v":253},null,4,"Aaron Groendyk",245,{"$f":"IFERROR(30-R4,\"\")","v":30},{"$f":"IFERROR(Q5+R5,\"\")","v":275},null,6,"Steve Marcus",192,{"$f":"IFERROR(30-X4,\"\")","v":30},{"$f":"IFERROR(W5+X5,\"\")","v":222}]
[{"$f":"B6","v":" 7-8"}," 7-8",3,"Eric Scott",216,{"$f":"IF(E6=\"\",\"\",IF(E6=E7,15,IF(E6>E7,30,0)))","v":0},216,null,5,"Chris Slagter",229,{"$f":"IF(K6=\"\",\"\",IF(K6=K7,15,IF(K6>K7,30,0)))","v":0},229,null,1,"George Miller",161,{"$f":"IF(Q6=\"\",\"\",IF(Q6=Q7,15,IF(Q6>Q7,30,0)))","v":0},161,null,7,"Ben Rabourn",224,{"$f":"IF(W6=\"\",\"\",IF(W6=W7,15,IF(W6>W7,30,0)))","v":30},254]
{"$rows_left_out":28}
{"sheet":"Standings","index":2,"n_rows":65,"n_cols":8,"rows_kept":65,"cut":false,"hidden":false,"merged":[[0,1,0,7]]}
[null,"Qualifying Results"]
[null,"Rank","Name","Game 1","Game 2","Game 3","Game 4","Total"]
[null,{"$f":"IF(ROW(C2)-1<=Bowlers,SMALL(tScores[RANK1],ROW(C2)-1),\"\")","v":1},{"$f":"IF($B3=\"\",\"\",INDEX(tScores[Name],MATCH(Standings!$B3,tScores[RANK1],0),1))","v":"George Miller"},{"$f":"IF($B3=\"\",\"\",INDEX(tScores[Game1],MATCH(Standings!$B3,tScores[RANK1],0),1))","v":234},{"$f":"IF($B3=\"\",\"\",INDEX(tScores[Game2],MATCH(Standings!$B3,tScores[RANK1],0),1))","v":200},{"$f":"IF($B3=\"\",\"\",INDEX(tScores[Game3],MATCH(Standings!$B3,tScores[RANK1],0),1))","v":300},{"$f":"IF($B3=\"\",\"\",INDEX(tScores[Game4],MATCH(Standings!$B3,tScores[RANK1],0),1))","v":257},{"$f":"IF($B3=\"\",\"\",INDEX(tScores[Total],MATCH(Standings!$B3,tScores[RANK1],0),1))","v":991.03}]
[null,{"$f":"IF(ROW(C3)-1<=Bowlers,SMALL(tScores[RANK1],ROW(C3)-1),\"\")","v":2},{"$f":"IF($B4=\"\",\"\",INDEX(tScores[Name],MATCH(Standings!$B4,tScores[RANK1],0),1))","v":"Mike Smith Jr"},{"$f":"IF($B4=\"\",\"\",INDEX(tScores[Game1],MATCH(Standings!$B4,tScores[RANK1],0),1))","v":262},{"$f":"IF($B4=\"\",\"\",INDEX(tScores[Game2],MATCH(Standings!$B4,tScores[RANK1],0),1))","v":299},{"$f":"IF($B4=\"\",\"\",INDEX(tScores[Game3],MATCH(Standings!$B4,tScores[RANK1],0),1))","v":238},{"$f":"IF($B4=\"\",\"\",INDEX(tScores[Game4],MATCH(Standings!$B4,tScores[RANK1],0),1))","v":187},{"$f":"IF($B4=\"\",\"\",INDEX(tScores[Total],MATCH(Standings!$B4,tScores[RANK1],0),1))","v":986.0299}]
[null,{"$f":"IF(ROW(C4)-1<=Bowlers,SMALL(tScores[RANK1],ROW(C4)-1),\"\")","v":3},{"$f":"IF($B5=\"\",\"\",INDEX(tScores[Name],MATCH(Standings!$B5,tScores[RANK1],0),1))","v":"Eric Scott"},{"$f":"IF($B5=\"\",\"\",INDEX(tScores[Game1],MATCH(Standings!$B5,tScores[RANK1],0),1))","v":257},{"$f":"IF($B5=\"\",\"\",INDEX(tScores[Game2],MATCH(Standings!$B5,tScores[RANK1],0),1))","v":238},{"$f":"IF($B5=\"\",\"\",INDEX(tScores[Game3],MATCH(Standings!$B5,tScores[RANK1],0),1))","v":268},{"$f":"IF($B5=\"\",\"\",INDEX(tScores[Game4],MATCH(Standings!$B5,tScores[RANK1],0),1))","v":211},{"$f":"IF($B5=\"\",\"\",INDEX(tScores[Total],MATCH(Standings!$B5,tScores[RANK1],0),1))","v":974.02679999999998}]
[null,{"$f":"IF(ROW(C5)-1<=Bowlers,SMALL(tScores[RANK1],ROW(C5)-1),\"\")","v":4},{"$f":"IF($B6=\"\",\"\",INDEX(tScores[Name],MATCH(Standings!$B6,tScores[RANK1],0),1))","v":"Aaron Groendyk"},{"$f":"IF($B6=\"\",\"\",INDEX(tScores[Game1],MATCH(Standings!$B6,tScores[RANK1],0),1))","v":234},{"$f":"IF($B6=\"\",\"\",INDEX(tScores[Game2],MATCH(Standings!$B6,tScores[RANK1],0),1))","v":269},{"$f":"IF($B6=\"\",\"\",INDEX(tScores[Game3],MATCH(Standings!$B6,tScores[RANK1],0),1))","v":226},{"$f":"IF($B6=\"\",\"\",INDEX(tScores[Game4],MATCH(Standings!$B6,tScores[RANK1],0),1))","v":208},{"$f":"IF($B6=\"\",\"\",INDEX(tScores[Total],MATCH(Standings!$B6,tScores[RANK1],0),1))","v":937.02689999999996}]
{"$rows_left_out":60}
{"sheet":"ScoreSheets","index":3,"n_rows":281,"n_cols":7,"rows_kept":281,"cut":false,"hidden":false,"merged":[[11,0,11,1],[15,0,15,1],[16,0,16,1],[17,0,17,1],[21,0,21,1],[22,0,22,1],[0,0,0,6],[3,0,3,1],[4,0,4,1],[5,0,5,1],[9,0,9,1],[10,0,10,1],[35,0,35,1],[38,0,38,1],[39,0,39,1],[40,0,40,1],[44,0,44,1],[45,0,45,1],[23,0,23,1],[27,0,27,1],[28,0,28,1],[29,0,29,1],[33,0,33,1],[34,0,34,1],[70,0,70,1],[58,0,58,1],[62,0,62,1],[63,0,63,1],[64,0,64,1],[68,0,68,1],[69,0,69,1],[46,0,46,1],[50,0,50,1],[51,0,51,1],[52,0,52,1],[56,0,56,1],[57,0,57,1],[93,0,93,1],[97,0,97,1],[98,0,98,1],[99,0,99,1],[103,0,103,1],[104,0,104,1],[81,0,81,1],[85,0,85,1],[86,0,86,1],[87,0,87,1],[91,0,91,1],[92,0,92,1],[116,0,116,1],[120,0,120,1],[121,0,121,1],[122,0,122,1],[126,0,126,1],[127,0,127,1],[105,0,105,1],[108,0,108,1],[109,0,109,1],[110,0,110,1],[114,0,114,1],[115,0,115,1],[140,0,140,1],[143,0,143,1],[144,0,144,1],[145,0,145,1],[149,0,149,1],[150,0,150,1],[128,0,128,1],[132,0,132,1],[133,0,133,1],[134,0,134,1],[138,0,138,1],[139,0,139,1],[163,0,163,1],[167,0,167,1],[168,0,168,1],[169,0,169,1],[173,0,173,1],[174,0,174,1],[151,0,151,1],[155,0,155,1],[156,0,156,1],[157,0,157,1],[161,0,161,1],[162,0,162,1],[186,0,186,1],[190,0,190,1],[191,0,191,1],[192,0,192,1],[196,0,196,1],[197,0,197,1],[175,0,175,1],[178,0,178,1],[179,0,179,1],[180,0,180,1],[184,0,184,1],[185,0,185,1],[210,0,210,1],[213,0,213,1],[214,0,214,1],[215,0,215,1],[219,0,219,1],[220,0,220,1],[198,0,198,1],[202,0,202,1],[203,0,203,1],[204,0,204,1],[208,0,208,1],[209,0,209,1],[233,0,233,1],[237,0,237,1],[238,0,238,1],[239,0,239,1],[243,0,243,1],[244,0,244,1],[221,0,221,1],[225,0,225,1],[226,0,226,1],[227,0,227,1],[231,0,231,1],[232,0,232,1],[280,0,280,1],[73,0,73,1],[74,0,74,1],[75,0,75,1],[79,0,79,1],[80,0,80,1],[268,0,268,1],[272,0,272,1],[273,0,273,1],[274,0,274,1],[278,0,278,1],[279,0,279,1],[256,0,256,1],[260,0,260,1],[261,0,261,1],[262,0,262,1],[266,0,266,1],[267,0,267,1],[245,0,245,1],[248,0,248,1],[249,0,249,1],[250,0,250,1],[254,0,254,1],[255,0,255,1]]}
[]
["SPOT/LANE","A",{"$f":"sLane","v":3},{"$f":"IF(C2+4>eLane,C2-(eLane-sLane)+3,C2+4)","v":7},{"$f":"IF(D2+4>eLane,D2-(eLane-sLane)+3,D2+4)","v":11},{"$f":"IF(E2+4>eLane,E2-(eLane-sLane)+3,E2+4)","v":15}]
[null,null,"GAME 1","GAME 2","GAME 3 ","GAME 4","TOTAL"]
[{"$f":"IFERROR(INDEX(tScores[Name],MATCH(C2&\"-\"&B2,tScores[Starting],0),1),\"\")","v":"Steve Marcus"}]
["Totals"]
["+/-"]
{"$rows_left_out":276}
{"sheet":"ScoreSheet-MP","index":4,"n_rows":42,"n_cols":6,"rows_kept":42,"cut":false,"hidden":false,"merged":[[38,0,38,5],[13,0,13,5],[18,0,18,5],[23,0,23,5],[28,0,28,5],[33,0,33,5],[0,0,0,5],[1,3,1,5],[3,0,3,5],[2,3,2,4],[8,0,8,5]]}
[]
["SEED",8,"NAME",{"$f":"IFERROR(VLOOKUP(B2,Standings!$B$3:$C$10,2,0),\"\")","v":"Mike Horian"}]
[null,null,null,"QUAL TOTAL",null,{"$f":"IFERROR(VLOOKUP(B2,Standings!$B$3:$H$10,7,0),\"\")","v":918.02679999999998}]
["MATCH 1"]
["LANES:",{"$f":"INDEX('Round Robin-StepLadder'!$A$4:$A$11,MATCH('ScoreSheet-MP'!B2,'Round Robin-StepLadder'!$C$4:$C$11,0))","v":"11-12"},null,"GAME","BONUS","TOTAL"]
[null,null,{"$f":"$D$2","v":"Mike Horian"}]
{"$rows_left_out":37}
{"sheet":"RR Seeds","index":5,"n_rows":10,"n_cols":8,"rows_kept":10,"cut":false,"hidden":true,"merged":[]}
[]
["SEED","GAME1","GAME2","GAME3","GAME4","GAME5","GAME6","GAME7"]
[1,2,3,8,5,7,4,6]
[2,1,4,6,7,5,3,8]
[3,4,1,7,6,8,2,5]
[4,3,2,5,8,6,1,7]
{"$rows_left_out":4}